{"text_format":"1","workbook":"xlsx","n_sheets":10,"sheets":["Tables","Exposures","FOFs","FundDecompositions","Data","ChartPrep","Chart_EN","Chart_FR","Table_EN","Table_FR"],"not_rendered":{"charts":4,"images":0,"macros":1,"external_links":0,"defined_names":36,"comments":1,"pivot_tables":0},"unopened":[{"sheet":"Chart_EN","index":6,"reason":"not_a_worksheet"},{"sheet":"Chart_FR","index":7,"reason":"not_a_worksheet"}],"bounds":{"document_bytes":16777216,"sheet_cells":100000,"rows_first":2000,"rows_last":500,"rows_between":2000,"halvings":0,"cell_chars":16384,"cell_head_chars":4096},"cells_cut":0,"cells_raw":0,"read":"whole","date_system":"1900"}

{"sheet":"Tables","index":0,"n_rows":174,"n_cols":9,"rows_kept":174,"cut":false,"hidden":true,"merged":[]}
["CurrencyCodes","CurrencyNamesEN","CurrencyNamesFR","MPowerFundCodes","AllRetailFundsEN","AllRetailFundsFR","FundsWithExposuresEN","FundsWithExposuresFR","MonthsFR"]
["AFN","Afghanistan Afghani","Afghani afghan","5299","Mackenzie All China Equity Fund","Fonds toutes actions Chine Mackenzie","Mackenzie All China Equity Fund","Fonds toutes actions Chine Mackenzie","janvier"]
["ALL","Albania Lek","Lek albanais","5401","Mackenzie Balanced ETF Portfolio","Portefeuille FNB équilibré Mackenzie","Mackenzie Balanced ETF Portfolio","Portefeuille FNB équilibré Mackenzie","février"]
["ALL","Albania Lek","Lek albanais","E23","Mackenzie Canadian Aggregate Bond Index ETF","FINB Obligations canadiennes totales Mackenzie","Mackenzie Canadian Aggregate Bond Index ETF","FINB Obligations canadiennes totales Mackenzie","mars"]
["DZD","Algeria Dinar","Dinar algérien","E25","Mackenzie Canadian All Corporate Bond Index ETF","FINB Obligations toutes sociétés canadiennes Mackenzie","Mackenzie Canadian All Corporate Bond Index ETF","FINB Obligations toutes sociétés canadiennes Mackenzie","mars"]
["AOA","Angola Kwanza","Kwanza angolais","302","Mackenzie Canadian Bond Fund","Fonds canadien d'obligations Mackenzie","Mackenzie Canadian Bond Fund","Fonds canadien d'obligations Mackenzie","avril"]
["ARS","Argentina Peso","Peso argentin","C98","Mackenzie Canadian Dividend Class","Catégorie Mackenzie Dividendes canadiennes","Mackenzie Canadian Dividend Class","Catégorie Mackenzie Dividendes canadiennes","mai"]
["AMD","Armenia Dram","Dram arménien","3072","Mackenzie Canadian Dividend Fund","Fonds de dividendes canadiennes Mackenzie","Mackenzie Canadian Dividend Fund","Fonds de dividendes canadiennes Mackenzie","juin"]
["AWG","Aruba Guilder","Florint d'Aruba","C58","Mackenzie Canadian Equity Class","Catégorie Mackenzie Actions canadiennes","Mackenzie Canadian Equity Class","Catégorie Mackenzie Actions canadiennes","juillet"]
["AUD","Australia Dollar","Dollar australien","2946","Mackenzie Canadian Equity Fund","Fonds d'actions canadiennes Mackenzie","Mackenzie Canadian Equity Fund","Fonds d'actions canadiennes Mackenzie","août"]
{"$rows_left_out":165}
{"sheet":"Exposures","index":1,"n_rows":1514,"n_cols":4,"rows_kept":1514,"cut":false,"hidden":true,"merged":[]}
["MPower fund code","Currency","gross exposure\n(millions)","net exposure\n(millions)"]
["086","AUD",97.227159,98.976497120000005]
["086","BRL",4.1775089999999997,4.8098600799999991]
["086","CAD",192.30126682000002,773.08528208999996]
["086","CHF",0,-0.29240384999999997]
["086","CLP",0.58040099999999994,0.58040099999999994]
["086","COP",0,0.94134382999999999]
["086","EUR",114.201285,104.67172281000001]
["086","GBP",74.960030000000003,41.805361859999998]
["086","HKD",60.746578999999997,60.746578999999997]
{"$rows_left_out":1505}
{"sheet":"FOFs","index":2,"n_rows":567,"n_cols":3,"rows_kept":567,"cut":false,"hidden":true,"merged":[]}
["MPower fund code","MPower fund code of underlying fund","investment in underlying fund\n(millions)"]
["086","4762",1.10312648]
["086","E03",1.4147592600000001]
["086","E11",10.09064]
["086","E27",5.3525596500000008]
["086","E28",2.43065416]
["086","E29",6.4011810000000002]
["086","E30",2.0241560000000001]
["1216","1238",8.9652019200000002]
["1216","307",3.55980835]
{"$rows_left_out":558}
{"sheet":"FundDecompositions","index":3,"n_rows":1144,"n_cols":86,"rows_kept":1144,"cut":false,"hidden":true,"merged":[]}
["MPower fund code","NAV\n(millions)","NAV in UF\n(millions)",1,{"$f":"D1+1","v":2},{"$f":"E1+1","v":3},4,5,6,7,8,9,10,11,12,13,14,15,16,17,18,19,20,{"$f":"W1+1","v":21},{"$f":"X1+1","v":22},{"$f":"Y1+1","v":23},{"$f":"Z1+1","v":24},{"$f":"AA1+1","v":25},{"$f":"AB1+1","v":26},{"$f":"AC1+1","v":27},{"$f":"AD1+1","v":28},{"$f":"AE1+1","v":29},{"$f":"AF1+1","v":30},{"$f":"AG1+1","v":31},{"$f":"AH1+1","v":32},{"$f":"AI1+1","v":33},{"$f":"AJ1+1","v":34},{"$f":"AK1+1","v":35},{"$f":"AL1+1","v":36},{"$f":"AM1+1","v":37},{"$f":"AN1+1","v":38},{"$f":"AO1+1","v":39},{"$f":"AP1+1","v":40},{"$f":"AQ1+1","v":41},1,{"$f":"AS1+1","v":2},{"$f":"AT1+1","v":3},4,5,6,7,8,9,10,11,12,13,14,15,16,17,18,19,20,{"$f":"BL1+1","v":21},{"$f":"BM1+1","v":22},{"$f":"BN1+1","v":23},{"$f":"BO1+1","v":24},{"$f":"BP1+1","v":25},{"$f":"BQ1+1","v":26},{"$f":"BR1+1","v":27},{"$f":"BS1+1","v":28},{"$f":"BT1+1","v":29},{"$f":"BU1+1","v":30},{"$f":"BV1+1","v":31},{"$f":"BW1+1","v":32},{"$f":"BX1+1","v":33},{"$f":"BY1+1","v":34},{"$f":"BZ1+1","v":35},{"$f":"CA1+1","v":36},{"$f":"CB1+1","v":37},{"$f":"CC1+1","v":38},{"$f":"CD1+1","v":39},{"$f":"CE1+1","v":40},{"$f":"CF1+1","v":41}]
["086",1697.0676010000002,28.8172,"086","4762","E03","E11","E27","E28","E29","E30","5960","E27","E29","E30",null,null,null,null,null,null,null,null,null,null,null,null,null,null,null,null,null,null,null,null,null,null,null,null,null,null,null,null,null,1,4.8599196482614608E-4,2.4726714744278768E-3,5.0978095965104706E-2,1.8026650687312077E-2,7.0864759372476299E-2,9.0749394997511945E-2,8.4050698929017519E-3,3.8546184787001739E-4,3.7700101852573198E-5,1.5617082866679462E-4,7.5271297354039495E-5]
["1081",24.228867000000001,0,"1081",null,null,null,null,null,null,null,null,null,null,null,null,null,null,null,null,null,null,null,null,null,null,null,null,null,null,null,null,null,null,null,null,null,null,null,null,null,null,null,null,1]
["1216",178.87036699999999,178.7715,"1216","1238","307","3091","3092","5025","5026","Q123",null,null,null,null,null,null,null,null,null,null,null,null,null,null,null,null,null,null,null,null,null,null,null,null,null,null,null,null,null,null,null,null,null,1,0.18306380278152701,4.0979989637030126E-3,0.19590563633246266,0.11641384054875235,0.13134258696969139,8.5693411383630735E-2,0.21892391351989893]
["1219",93.039925999999994,93.034700000000001,"1219","1234","3069","3091","3092","4762","5027","5253","5960","E27","E29","E30",null,null,null,null,null,null,null,null,null,null,null,null,null,null,null,null,null,null,null,null,null,null,null,null,null,null,null,null,null,1,0.12831572315729384,1.9381199839379033E-2,2.623190192749764E-2,8.9006576483897315E-2,4.0819930003153076E-3,7.9567062863781846E-2,0.25369818863953347,3.2376102462041449E-3,3.1665451902775717E-4,1.311725862997232E-3,6.3222631475760383E-4]
["1232",57.885778000000002,57.863999999999997,"1232","2979",null,null,null,null,null,null,null,null,null,null,null,null,null,null,null,null,null,null,null,null,null,null,null,null,null,null,null,null,null,null,null,null,null,null,null,null,null,null,null,1,8.6524795370029634E-2]
["1234",28.904487,0,"1234",null,null,null,null,null,null,null,null,null,null,null,null,null,null,null,null,null,null,null,null,null,null,null,null,null,null,null,null,null,null,null,null,null,null,null,null,null,null,null,null,1]
["1237",127.06736600000001,127.2675,"1237","1238","307","3091","3092","5025","5026","5027","Q123",null,null,null,null,null,null,null,null,null,null,null,null,null,null,null,null,null,null,null,null,null,null,null,null,null,null,null,null,null,null,null,null,1,0.23433795757262663,2.9044198837786367E-3,4.9056990759752145E-2,3.453232091896196E-2,0.20308617945281759,0.16808537486281608,0.25275185066007544,7.5072823390785595E-2]
["1238",48.973068999999995,0,"1238",null,null,null,null,null,null,null,null,null,null,null,null,null,null,null,null,null,null,null,null,null,null,null,null,null,null,null,null,null,null,null,null,null,null,null,null,null,null,null,null,1]
["1240",6.0320479999999996,0,"1240",null,null,null,null,null,null,null,null,null,null,null,null,null,null,null,null,null,null,null,null,null,null,null,null,null,null,null,null,null,null,null,null,null,null,null,null,null,null,null,null,1]
{"$rows_left_out":1135}
{"sheet":"Data","index":4,"n_rows":3004,"n_cols":7,"rows_kept":3004,"cut":false,"hidden":true,"merged":[]}
["MPower fund code","Currency","gross exposure\n(millions)","net exposure\n(millions)","gross exposure\n(% of NAV)","net exposure\n(% of NAV)","% of exposure hedged"]
["086","AUD",97.228930739134356,98.97653972703111,5.7292314542528748E-2,5.83220961422109E-2,-1.7974166481225629E-2]
["086","BRL",4.814584854754056,5.4501825279593845,2.8370024003487285E-3,3.2115294216679313E-3,-0.13201505267431757]
["086","CAD",166.7980285555584,765.55739139326363,9.8286024997211896E-2,0.45110600861937594]
["086","CHF",2.1910807818475397E-5,-0.29239377637090469,1.2910981164495389E-8,-1.7229353525510986E-4,13345.728263480798]
["086","CLP",0.71763038678084567,0.71763038678084567,4.2286493878078028E-4,4.2286493878078028E-4,0]
["086","COP",0.26667484085703091,1.2080306659710369,1.571386083011843E-4,7.1183414613008747E-4,-3.5299761390639901]
["086","EUR",114.40124919612298,104.67062296504226,6.7411132706866231E-2,6.1677344476461782E-2,8.5056992816565202E-2]
["086","GBP",75.141129156752598,41.810703041735216,4.4277039498457571E-2,2.4637028626163869E-2,0.4435710041765073]
["086","HKD",60.746578999999997,60.746578999999997,3.5795026079102565E-2,3.5795026079102565E-2,0]
{"$rows_left_out":2995}
{"sheet":"ChartPrep","index":5,"n_rows":43,"n_cols":15,"rows_kept":43,"cut":false,"hidden":true,"merged":[[1,13,1,14],[1,4,1,11]]}
[]
[null,null,null,null,"fund's unique currency exposures\n(unsorted)",null,null,null,null,null,null,null,null,"chart\nformulae"]
[null,null,null,null,"#","include","r","code","currency","gross","net","i",null,"Step","MaxMin"]
[null,"data as of","2019-10-31",null,1,{"$f":"NOT(E4>nCurrencyExposures)","v":true},{"$f":"MATCH(PresentedFundMPowerCode,OFFSET(tData,0,0,,1),0)","v":1429},{"$f":"IF($F4,INDEX(tData,$G4,2),\"\")","v":"CAD"},{"$f":"IF($F4,INDEX(tCurrencyNamesEN,MATCH($H4,tCurrencyCodes,0),1),\"\")","v":"Canada Dollar"},{"$f":"IF($F4,INDEX(tData,$G4,5),\"\")","v":1.4599090914578568E-2},{"$f":"IF($F4,INDEX(tData,$G4,6),\"\")","v":1.4599090914578568E-2},{"$f":"IF($F4,RANK(K4,OFFSET(K$4,0,0,nCurrencyExposures,1),1)-ROW(K4)/100,\"\")","v":0.96},null,{"$f":"nCurrencyExposures-0.5","v":3.5},{"$f":"MAX(vGrossExposures,vNetExposures)","v":0.65918040456112181}]
[null,"index of fund selected",1,null,{"$f":"E4+1","v":2},true,{"$f":"IF($F5,G4+1,\"\")","v":1430},"CNY","China Yuan Renminbi",0.65918040456112181,0.65918040456112181,3.95,null,{"$f":"IF($F5,N4-1,\"\")","v":2.5},{"$f":"MIN(vGrossExposures,vNetExposures)","v":1.4599090914578568E-2}]
[null,"MPower fund code of fund selected",{"$f":"INDEX(tMPowerFundCodes,MATCH(SelectedFundNameEN,tAllRetailFundsEN,0),1)","v":"5299"},null,3,true,1431,"HKD","Hong Kong Dollar",0.24427049818605465,0.24427049818605465,2.94,null,1.5,{"$f":"IF($F6,O5,\"\")","v":1.4599090914578568E-2}]
[null,"# of unique currency exposures this fund has",{"$f":"COUNTIF(OFFSET(tData,0,0,,1),PresentedFundMPowerCode)","v":4},null,4,true,1432,"USD","United States Dollar",8.1949402695866869E-2,8.1949402695866869E-2,1.93,null,0.5,1.4599090914578568E-2]
[null,null,null,null,5,false,"","","","","","",null,"",""]
[null,"Update 'Tables' tab with Name changes, Launches, & Terminations.",null,null,6,false,"","","","","","",null,"",""]
[null,null,null,null,7,false,"","","","","","",null,"",""]
{"$rows_left_out":34}
{"sheet":"Table_EN","index":8,"n_rows":43,"n_cols":5,"rows_kept":43,"cut":false,"hidden":false,"merged":[]}
[null,null,{"$f":"INDEX(tFundsWithExposuresEN,ChartPrep!C5)","v":"Mackenzie All China Equity Fund"}]
[null,null,{"$f":"\"as of \" & TEXT(ChartPrep!C4,\"mmmm d,yyyy\")","v":"as of October 31,2019"}]
["i",null,"currency","gross currency exposure from portfolio investments","net currency exposure after any hedging"]
[{"$f":"IF(ChartPrep!$F4,LARGE(OFFSET(ChartPrep!$L$4,0,0,nCurrencyExposures,1),ChartPrep!E4),\"\")","v":3.95},null,{"$f":"IF(ChartPrep!$F4,INDEX(ChartPrep!I$4:I$43,MATCH($A4,ChartPrep!$L$4:$L$43,0)),\"\")","v":"China Yuan Renminbi"},{"$f":"IF(ChartPrep!$F4,INDEX(ChartPrep!J$4:J$43,MATCH($A4,ChartPrep!$L$4:$L$43,0)),\"\")","v":0.65918040456112181},{"$f":"IF(ChartPrep!$F4,INDEX(ChartPrep!K$4:K$43,MATCH($A4,ChartPrep!$L$4:$L$43,0)),\"\")","v":0.65918040456112181}]
[{"$f":"IF(ChartPrep!$F5,LARGE(OFFSET(ChartPrep!$L$4,0,0,nCurrencyExposures,1),ChartPrep!E5),\"\")","v":2.94},null,{"$f":"IF(ChartPrep!$F5,INDEX(ChartPrep!I$4:I$43,MATCH($A5,ChartPrep!$L$4:$L$43,0)),\"\")","v":"Hong Kong Dollar"},{"$f":"IF(ChartPrep!$F5,INDEX(ChartPrep!J$4:J$43,MATCH($A5,ChartPrep!$L$4:$L$43,0)),\"\")","v":0.24427049818605465},{"$f":"IF(ChartPrep!$F5,INDEX(ChartPrep!K$4:K$43,MATCH($A5,ChartPrep!$L$4:$L$43,0)),\"\")","v":0.24427049818605465}]
[{"$f":"IF(ChartPrep!$F6,LARGE(OFFSET(ChartPrep!$L$4,0,0,nCurrencyExposures,1),ChartPrep!E6),\"\")","v":1.93},null,{"$f":"IF(ChartPrep!$F6,INDEX(ChartPrep!I$4:I$43,MATCH($A6,ChartPrep!$L$4:$L$43,0)),\"\")","v":"United States Dollar"},{"$f":"IF(ChartPrep!$F6,INDEX(ChartPrep!J$4:J$43,MATCH($A6,ChartPrep!$L$4:$L$43,0)),\"\")","v":8.1949402695866869E-2},{"$f":"IF(ChartPrep!$F6,INDEX(ChartPrep!K$4:K$43,MATCH($A6,ChartPrep!$L$4:$L$43,0)),\"\")","v":8.1949402695866869E-2}]
[{"$f":"IF(ChartPrep!$F7,LARGE(OFFSET(ChartPrep!$L$4,0,0,nCurrencyExposures,1),ChartPrep!E7),\"\")","v":0.96},null,{"$f":"IF(ChartPrep!$F7,INDEX(ChartPrep!I$4:I$43,MATCH($A7,ChartPrep!$L$4:$L$43,0)),\"\")","v":"Canada Dollar"},{"$f":"IF(ChartPrep!$F7,INDEX(ChartPrep!J$4:J$43,MATCH($A7,ChartPrep!$L$4:$L$43,0)),\"\")","v":1.4599090914578568E-2},{"$f":"IF(ChartPrep!$F7,INDEX(ChartPrep!K$4:K$43,MATCH($A7,ChartPrep!$L$4:$L$43,0)),\"\")","v":1.4599090914578568E-2}]
[{"$f":"IF(ChartPrep!$F8,LARGE(OFFSET(ChartPrep!$L$4,0,0,nCurrencyExposures,1),ChartPrep!E8),\"\")","v":""},null,{"$f":"IF(ChartPrep!$F8,INDEX(ChartPrep!I$4:I$43,MATCH($A8,ChartPrep!$L$4:$L$43,0)),\"\")","v":""},{"$f":"IF(ChartPrep!$F8,INDEX(ChartPrep!J$4:J$43,MATCH($A8,ChartPrep!$L$4:$L$43,0)),\"\")","v":""},{"$f":"IF(ChartPrep!$F8,INDEX(ChartPrep!K$4:K$43,MATCH($A8,ChartPrep!$L$4:$L$43,0)),\"\")","v":""}]
[{"$f":"IF(ChartPrep!$F9,LARGE(OFFSET(ChartPrep!$L$4,0,0,nCurrencyExposures,1),ChartPrep!E9),\"\")","v":""},null,{"$f":"IF(ChartPrep!$F9,INDEX(ChartPrep!I$4:I$43,MATCH($A9,ChartPrep!$L$4:$L$43,0)),\"\")","v":""},{"$f":"IF(ChartPrep!$F9,INDEX(ChartPrep!J$4:J$43,MATCH($A9,ChartPrep!$L$4:$L$43,0)),\"\")","v":""},{"$f":"IF(ChartPrep!$F9,INDEX(ChartPrep!K$4:K$43,MATCH($A9,ChartPrep!$L$4:$L$43,0)),\"\")","v":""}]
[{"$f":"IF(ChartPrep!$F10,LARGE(OFFSET(ChartPrep!$L$4,0,0,nCurrencyExposures,1),ChartPrep!E10),\"\")","v":""},null,{"$f":"IF(ChartPrep!$F10,INDEX(ChartPrep!I$4:I$43,MATCH($A10,ChartPrep!$L$4:$L$43,0)),\"\")","v":""},{"$f":"IF(ChartPrep!$F10,INDEX(ChartPrep!J$4:J$43,MATCH($A10,ChartPrep!$L$4:$L$43,0)),\"\")","v":""},{"$f":"IF(ChartPrep!$F10,INDEX(ChartPrep!K$4:K$43,MATCH($A10,ChartPrep!$L$4:$L$43,0)),\"\")","v":""}]
{"$rows_left_out":34}
{"sheet":"Table_FR","index":9,"n_rows":43,"n_cols":5,"rows_kept":43,"cut":false,"hidden":true,"merged":[]}
[null,null,{"$f":"INDEX(tFundsWithExposuresFR,ChartPrep!C5)","v":"Fonds toutes actions Chine Mackenzie"}]
[null,null,{"$f":"\"au \" & TEXT(ChartPrep!C4,\"d\") & \" \" & INDEX(tMonthsFR,MONTH(ChartPrep!C4)+1,1) & \" \" & TEXT(ChartPrep!C4,\"yyyy\")","v":"au 31 octobre 2019"}]
[null,null,"devise","exposition aux devises brute provenant des placements en portefeuille","exposition aux devises nette après toute couverture"]
[{"$f":"IF(ChartPrep!$F4,LARGE(OFFSET(ChartPrep!$L$4,0,0,nCurrencyExposures,1),ChartPrep!E4),\"\")","v":3.95},null,{"$f":"IF(ChartPrep!$F4,INDEX(tCurrencyNamesFR,MATCH(Table_EN!C4,tCurrencyNamesEN,0),1),\"\")","v":"Yuan renminbi chinois"},{"$f":"IF(ChartPrep!$F4,INDEX(ChartPrep!J$4:J$43,MATCH($A4,ChartPrep!$L$4:$L$43,0)),\"\")","v":0.65918040456112181},{"$f":"IF(ChartPrep!$F4,INDEX(ChartPrep!K$4:K$43,MATCH($A4,ChartPrep!$L$4:$L$43,0)),\"\")","v":0.65918040456112181}]
[{"$f":"IF(ChartPrep!$F5,LARGE(OFFSET(ChartPrep!$L$4,0,0,nCurrencyExposures,1),ChartPrep!E5),\"\")","v":2.94},null,{"$f":"IF(ChartPrep!$F5,INDEX(tCurrencyNamesFR,MATCH(Table_EN!C5,tCurrencyNamesEN,0),1),\"\")","v":"Dollar de Hong Kong"},{"$f":"IF(ChartPrep!$F5,INDEX(ChartPrep!J$4:J$43,MATCH($A5,ChartPrep!$L$4:$L$43,0)),\"\")","v":0.24427049818605465},{"$f":"IF(ChartPrep!$F5,INDEX(ChartPrep!K$4:K$43,MATCH($A5,ChartPrep!$L$4:$L$43,0)),\"\")","v":0.24427049818605465}]
[{"$f":"IF(ChartPrep!$F6,LARGE(OFFSET(ChartPrep!$L$4,0,0,nCurrencyExposures,1),ChartPrep!E6),\"\")","v":1.93},null,{"$f":"IF(ChartPrep!$F6,INDEX(tCurrencyNamesFR,MATCH(Table_EN!C6,tCurrencyNamesEN,0),1),\"\")","v":"Dollar américain"},{"$f":"IF(ChartPrep!$F6,INDEX(ChartPrep!J$4:J$43,MATCH($A6,ChartPrep!$L$4:$L$43,0)),\"\")","v":8.1949402695866869E-2},{"$f":"IF(ChartPrep!$F6,INDEX(ChartPrep!K$4:K$43,MATCH($A6,ChartPrep!$L$4:$L$43,0)),\"\")","v":8.1949402695866869E-2}]
[{"$f":"IF(ChartPrep!$F7,LARGE(OFFSET(ChartPrep!$L$4,0,0,nCurrencyExposures,1),ChartPrep!E7),\"\")","v":0.96},null,{"$f":"IF(ChartPrep!$F7,INDEX(tCurrencyNamesFR,MATCH(Table_EN!C7,tCurrencyNamesEN,0),1),\"\")","v":"Dollar canadien"},{"$f":"IF(ChartPrep!$F7,INDEX(ChartPrep!J$4:J$43,MATCH($A7,ChartPrep!$L$4:$L$43,0)),\"\")","v":1.4599090914578568E-2},{"$f":"IF(ChartPrep!$F7,INDEX(ChartPrep!K$4:K$43,MATCH($A7,ChartPrep!$L$4:$L$43,0)),\"\")","v":1.4599090914578568E-2}]
[{"$f":"IF(ChartPrep!$F8,LARGE(OFFSET(ChartPrep!$L$4,0,0,nCurrencyExposures,1),ChartPrep!E8),\"\")","v":""},null,{"$f":"IF(ChartPrep!$F8,INDEX(tCurrencyNamesFR,MATCH(Table_EN!C8,tCurrencyNamesEN,0),1),\"\")","v":""},{"$f":"IF(ChartPrep!$F8,INDEX(ChartPrep!J$4:J$43,MATCH($A8,ChartPrep!$L$4:$L$43,0)),\"\")","v":""},{"$f":"IF(ChartPrep!$F8,INDEX(ChartPrep!K$4:K$43,MATCH($A8,ChartPrep!$L$4:$L$43,0)),\"\")","v":""}]
[{"$f":"IF(ChartPrep!$F9,LARGE(OFFSET(ChartPrep!$L$4,0,0,nCurrencyExposures,1),ChartPrep!E9),\"\")","v":""},null,{"$f":"IF(ChartPrep!$F9,INDEX(tCurrencyNamesFR,MATCH(Table_EN!C9,tCurrencyNamesEN,0),1),\"\")","v":""},{"$f":"IF(ChartPrep!$F9,INDEX(ChartPrep!J$4:J$43,MATCH($A9,ChartPrep!$L$4:$L$43,0)),\"\")","v":""},{"$f":"IF(ChartPrep!$F9,INDEX(ChartPrep!K$4:K$43,MATCH($A9,ChartPrep!$L$4:$L$43,0)),\"\")","v":""}]
[{"$f":"IF(ChartPrep!$F10,LARGE(OFFSET(ChartPrep!$L$4,0,0,nCurrencyExposures,1),ChartPrep!E10),\"\")","v":""},null,{"$f":"IF(ChartPrep!$F10,INDEX(tCurrencyNamesFR,MATCH(Table_EN!C10,tCurrencyNamesEN,0),1),\"\")","v":""},{"$f":"IF(ChartPrep!$F10,INDEX(ChartPrep!J$4:J$43,MATCH($A10,ChartPrep!$L$4:$L$43,0)),\"\")","v":""},{"$f":"IF(ChartPrep!$F10,INDEX(ChartPrep!K$4:K$43,MATCH($A10,ChartPrep!$L$4:$L$43,0)),\"\")","v":""}]
{"$rows_left_out":33}