{"text_format":"1","workbook":"xlsx","n_sheets":10,"sheets":["Tables","Exposures","FOFs","FundDecompositions","Data","ChartPrep","Chart_EN","Chart_FR","Table_EN","Table_FR"],"not_rendered":{"charts":4,"images":0,"macros":1,"external_links":0,"defined_names":36,"comments":1,"pivot_tables":0},"unopened":[{"sheet":"Chart_EN","index":6,"reason":"not_a_worksheet"},{"sheet":"Chart_FR","index":7,"reason":"not_a_worksheet"}],"bounds":{"document_bytes":16777216,"sheet_cells":100000,"rows_first":2000,"rows_last":500,"rows_between":2000,"halvings":0,"cell_chars":16384,"cell_head_chars":4096},"cells_cut":0,"cells_raw":0,"read":"whole","date_system":"1900"}

{"sheet":"Tables","index":0,"n_rows":174,"n_cols":9,"rows_kept":174,"cut":false,"hidden":true,"merged":[]}
["CurrencyCodes","CurrencyNamesEN","CurrencyNamesFR","MPowerFundCodes","AllRetailFundsEN","AllRetailFundsFR","FundsWithExposuresEN","FundsWithExposuresFR","MonthsFR"]
["AFN","Afghanistan Afghani","Afghani afghan","5299","Mackenzie All China Equity Fund","Fonds toutes actions Chine Mackenzie","Mackenzie All China Equity Fund","Fonds toutes actions Chine Mackenzie","janvier"]
["ALL","Albania Lek","Lek albanais","5401","Mackenzie Balanced ETF Portfolio","Portefeuille FNB équilibré Mackenzie","Mackenzie Balanced ETF Portfolio","Portefeuille FNB équilibré Mackenzie","février"]
["ALL","Albania Lek","Lek albanais","E23","Mackenzie Canadian Aggregate Bond Index ETF","FINB Obligations canadiennes totales Mackenzie","Mackenzie Canadian Aggregate Bond Index ETF","FINB Obligations canadiennes totales Mackenzie","mars"]
["DZD","Algeria Dinar","Dinar algérien","E25","Mackenzie Canadian All Corporate Bond Index ETF","FINB Obligations toutes sociétés canadiennes Mackenzie","Mackenzie Canadian All Corporate Bond Index ETF","FINB Obligations toutes sociétés canadiennes Mackenzie","mars"]
["AOA","Angola Kwanza","Kwanza angolais","302","Mackenzie Canadian Bond Fund","Fonds canadien d'obligations Mackenzie","Mackenzie Canadian Bond Fund","Fonds canadien d'obligations Mackenzie","avril"]
["ARS","Argentina Peso","Peso argentin","C98","Mackenzie Canadian Dividend Class","Catégorie Mackenzie Dividendes canadiennes","Mackenzie Canadian Dividend Class","Catégorie Mackenzie Dividendes canadiennes","mai"]
["AMD","Armenia Dram","Dram arménien","3072","Mackenzie Canadian Dividend Fund","Fonds de dividendes canadiennes Mackenzie","Mackenzie Canadian Dividend Fund","Fonds de dividendes canadiennes Mackenzie","juin"]
["AWG","Aruba Guilder","Florint d'Aruba","C58","Mackenzie Canadian Equity Class","Catégorie Mackenzie Actions canadiennes","Mackenzie Canadian Equity Class","Catégorie Mackenzie Actions canadiennes","juillet"]
["AUD","Australia Dollar","Dollar australien","2946","Mackenzie Canadian Equity Fund","Fonds d'actions canadiennes Mackenzie","Mackenzie Canadian Equity Fund","Fonds d'actions canadiennes Mackenzie","août"]
["AZN","Azerbaijan New Manat","Manat azerbaïdjanais","E18","Mackenzie Canadian Equity Index ETF","FINB Actions canadiennes Mackenzie","Mackenzie Canadian Equity Index ETF","FINB Actions canadiennes Mackenzie","septembre"]
["BSD","Bahamas Dollar","Dollar bahaméen","C515","Mackenzie Canadian Growth Balanced Class","Catégorie Mackenzie Équilibré canadien de croissance","Mackenzie Canadian Growth Balanced Class","Catégorie Mackenzie Équilibré canadien de croissance","octobre"]
["BHD","Bahrain Dinar","Dinar bahreïni","724","Mackenzie Canadian Growth Balanced Fund","Fonds équilibré canadien de croissance Mackenzie","Mackenzie Canadian Growth Balanced Fund","Fonds équilibré canadien de croissance Mackenzie","novembre"]
["BDT","Bangladesh Taka","Taka bangladais","C513","Mackenzie Canadian Growth Class","Catégorie Mackenzie Canadien de croissance","Mackenzie Canadian Growth Class","Catégorie Mackenzie Canadien de croissance","décembre"]
["BBD","Barbados Dollar","Dollar de Barbade","650","Mackenzie Canadian Growth Fund","Fonds canadien de croissance Mackenzie","Mackenzie Canadian Growth Fund","Fonds canadien de croissance Mackenzie"]
["BYR","Belarus Ruble","Rouble biélorusse","E17","Mackenzie Canadian Large Cap Equity Index ETF","FINB Actions canadiennes grandes capitalisations Mackenzie","Mackenzie Canadian Large Cap Equity Index ETF","FINB Actions canadiennes grandes capitalisations Mackenzie"]
["BZD","Belize Dollar","Dollar du Bélize","307","Mackenzie Canadian Money Market Fund","Fonds du marché monétaire canadien Mackenzie","Mackenzie Canadian Money Market Fund","Fonds du marché monétaire canadien Mackenzie"]
["BMD","Bermuda Dollar","Dollar des Bermudes","E15","Mackenzie Canadian Short Term Fixed Income ETF","FNB de revenu fixe à court terme canadien Mackenzie","Mackenzie Canadian Short Term Fixed Income ETF","FNB de revenu fixe à court terme canadien Mackenzie"]
["BTN","Bhutan Ngultrum","Ngultrum bhoutanais","618","Mackenzie Canadian Short Term Income Fund","Fonds de revenu à court terme canadien Mackenzie","Mackenzie Canadian Short Term Income Fund","Fonds de revenu à court terme canadien Mackenzie"]
["BOB","Bolivia Boliviano","Boliviano bolivien","E24","Mackenzie Canadian Short-Term Bond Index ETF","FINB Obligations à court terme canadiennes Mackenzie","Mackenzie Canadian Short-Term Bond Index ETF","FINB Obligations à court terme canadiennes Mackenzie"]
["BAM","Bosnia and Herzegovina Convertible Marka","Mark convertible de Bosnie-Herzégovine","C57","Mackenzie Canadian Small Cap Class","Catégorie Mackenzie Petites capitalisations canadiennes","Mackenzie Canadian Small Cap Class","Catégorie Mackenzie Petites capitalisations canadiennes"]
["BWP","Botswana Pula","Pula botswanais","2947","Mackenzie Canadian Small Cap Fund","Fonds de petites capitalisations canadiennes Mackenzie","Mackenzie Canadian Small Cap Fund","Fonds de petites capitalisations canadiennes Mackenzie"]
["BRL","Brazil Real","Réal du Brésil","E16","Mackenzie China A-Shares CSI 300 Index ETF","FINB Actions chinoises de type A CSI 300 Mackenzie","Mackenzie China A-Shares CSI 300 Index ETF","FINB Actions chinoises de type A CSI 300 Mackenzie"]
["BND","Brunei Darussalam Dollar","Dollar de Brunei","5421","Mackenzie Conservative ETF Portfolio","Portefeuille FNB prudent Mackenzie","Mackenzie Conservative ETF Portfolio","Portefeuille FNB prudent Mackenzie"]
["BGN","Bulgaria Lev","Lev bulgare","5441","Mackenzie Conservative Income ETF Portfolio","Portefeuille FNB revenu prudent Mackenzie","Mackenzie Conservative Income ETF Portfolio","Portefeuille FNB revenu prudent Mackenzie"]
["BIF","Burundi Franc","Franc burundais","E04","Mackenzie Core Plus Canadian Fixed Income ETF","FNB de revenu fixe canadien de base plus Mackenzie","Mackenzie Core Plus Canadian Fixed Income ETF","FNB de revenu fixe canadien de base plus Mackenzie"]
["KHR","Cambodia Riel","Riel cambodgien","E01","Mackenzie Core Plus Global Fixed Income ETF","FNB de revenu fixe mondial de base plus Mackenzie","Mackenzie Core Plus Global Fixed Income ETF","FNB de revenu fixe mondial de base plus Mackenzie"]
["CAD","Canada Dollar","Dollar canadien","756","Mackenzie Corporate Bond Fund","Fonds d'obligations de sociétés Mackenzie","Mackenzie Corporate Bond Fund","Fonds d'obligations de sociétés Mackenzie"]
["CVE","Cape Verde Escudo","Escudo cap-verdien","5960","Mackenzie Credit Absolute Return Fund","Fonds à rendement absolu de titres de créance Mackenzie","Mackenzie Credit Absolute Return Fund","Fonds à rendement absolu de titres de créance Mackenzie"]
["KYD","Cayman Islands Dollar","Dollar des îles Caïmans","740","Mackenzie Cundill Canadian Balanced Fund","Fonds canadien équilibré Mackenzie Cundill","Mackenzie Cundill Canadian Balanced Fund","Fonds canadien équilibré Mackenzie Cundill"]
["CLP","Chile Peso","Peso chilien","C96","Mackenzie Cundill Canadian Security Class","Catégorie Mackenzie Cundill Canadien sécurité","Mackenzie Cundill Canadian Security Class","Catégorie Mackenzie Cundill Canadien sécurité"]
["CNY","China Yuan Renminbi","Yuan renminbi chinois","738","Mackenzie Cundill Canadian Security Fund","Fonds canadien sécurité Mackenzie Cundill","Mackenzie Cundill Canadian Security Fund","Fonds canadien sécurité Mackenzie Cundill"]
["COP","Colombia Peso","Peso colombien","C88","Mackenzie Cundill US Class","Catégorie Mackenzie Cundill Américain","Mackenzie Cundill US Class","Catégorie Mackenzie Cundill Américain"]
["XOF","Communauté Financière Africaine (BCEAO) Franc","Franc BCEAO (Communauté Financière Africaine)","C24","Mackenzie Cundill Value Class","Catégorie Mackenzie Cundill Valeur","Mackenzie Cundill Value Class","Catégorie Mackenzie Cundill Valeur"]
["XAF","Communauté Financière Africaine (BEAC) CFA Franc BEAC","Franc CFA - BEAC (Communauté Financière Africaine)","736","Mackenzie Cundill Value Fund","Fonds de valeur Mackenzie Cundill","Mackenzie Cundill Value Fund","Fonds de valeur Mackenzie Cundill"]
["KMF","Comoros Franc","Franc comorien","4855","Mackenzie Diversified Alternatives Fund","Fonds de stratégies alternatives diversifiées Mackenzie","Mackenzie Diversified Alternatives Fund","Fonds de stratégies alternatives diversifiées Mackenzie"]
["XPF","Comptoirs Français du Pacifique (CFP) Franc","Franc CFP (Comptoirs Français du Pacifique)","E30","Mackenzie Emerging Markets Bond Index ETF (CAD-Hedged)","FINB Obligations Marchés émergents Mackenzie (couvert en $ CA)","Mackenzie Emerging Markets Bond Index ETF (CAD-Hedged)","FINB Obligations Marchés émergents Mackenzie (couvert en $ CA)"]
["CDF","Congo/Kinshasa Franc","Franc congolais","E29","Mackenzie Emerging Markets Local Currency Bond Index ETF","FINB Obligations de marchés émergents en monnaie locale Mackenzie","Mackenzie Emerging Markets Class","Catégorie Mackenzie Marchés émergents"]
["CRC","Costa Rica Colon","Colon costaricien","C35","Mackenzie Emerging Markets Class","Catégorie Mackenzie Marchés émergents","Mackenzie Emerging Markets Fund","Fonds Marchés émergents Mackenzie"]
["HRK","Croatia Kuna","Kuna croate","5501","Mackenzie Emerging Markets Fund","Fonds Marchés émergents Mackenzie","Mackenzie Emerging Markets Local Currency Bond Index ETF","FINB Obligations de marchés émergents en monnaie locale Mackenzie"]
["CRK","Croatia Koruna","Couronne croate","E03","Mackenzie Floating Rate Income ETF","FNB de revenu à taux variable Mackenzie","Mackenzie Floating Rate Income ETF","FNB de revenu à taux variable Mackenzie"]
["CUC","Cuba Convertible Peso","Peso cubain convertible","4324","Mackenzie Floating Rate Income Fund","Fonds de revenu à taux variable Mackenzie","Mackenzie Floating Rate Income Fund","Fonds de revenu à taux variable Mackenzie"]
["CUP","Cuba Peso","Peso cubain","5093","Mackenzie Global Credit Opportunities Fund","Fonds d'opportunités en titres de créance mondiaux Mackenzie","Mackenzie Global Credit Opportunities Fund","Fonds d'opportunités en titres de créance mondiaux Mackenzie"]
["CZK","Czech Republic Koruna","Couronne tchèque","2421","Mackenzie Global Dividend Fund","Fonds mondial de dividendes Mackenzie","Mackenzie Global Dividend Fund","Fonds mondial de dividendes Mackenzie"]
["DKK","Denmark Krone","Couronne danoise","734","Mackenzie Global Equity Fund","Fonds d'actions mondiales Mackenzie","Mackenzie Global Environmental Equity Fund","Fonds d'actions mondiales de l'environnement Mackenzie"]
["DJF","Djibouti Franc","Franc de Djibouti","5782","Mackenzie Global Environmental Equity Fund","Fonds d'actions mondiales de l'environnement Mackenzie","Mackenzie Global Equity Fund","Fonds d'actions mondiales Mackenzie"]
["DOP","Dominican Republic Peso","Peso dominicain","5937","Mackenzie Global Growth Balanced Fund ","Fonds équilibré mondial de croissance Mackenzie","Mackenzie Global Growth Balanced Fund ","Fonds équilibré mondial de croissance Mackenzie"]
["XCD","East Caribbean Dollar","Dollar des Caraïbes orientales","C55","Mackenzie Global Growth Class","Catégorie Mackenzie Croissance mondiale","Mackenzie Global Growth Class","Catégorie Mackenzie Croissance mondiale"]
["EGP","Egypt Pound","Livre égyptienne","E11","Mackenzie Global High Yield Fixed Income ETF","FNB de revenu fixe à rendement élevé mondial Mackenzie","Mackenzie Global High Yield Fixed Income ETF","FNB de revenu fixe à rendement élevé mondial Mackenzie"]
["SVC","El Salvador Colon","Colon salvadorien","E12","Mackenzie Global Leadership Impact ETF","FNB mondial de leadership d’impact Mackenzie","Mackenzie Global Leadership Impact ETF","FNB mondial de leadership d’impact Mackenzie"]
["ERN","Eritrea Nakfa","Nafka érythréen","5279","Mackenzie Global Leadership Impact Fund","Fonds mondial de leadership d'impact Mackenzie","Mackenzie Global Leadership Impact Fund","Fonds mondial de leadership d'impact Mackenzie"]
["ETB","Ethiopia Birr","Birr éthiopien","5968","Mackenzie Global Long/Short Equity Alpha Fund","Fonds alpha d'actions acheteur/vendeur mondiales Mackenzie","Mackenzie Global Long/Short Equity Alpha Fund","Fonds alpha d'actions acheteur/vendeur mondiales Mackenzie"]
["EUR","Euro","Euro","5976","Mackenzie Global Macro Fund","Fonds global macro Mackenzie","Mackenzie Global Macro Fund","Fonds global macro Mackenzie"]
["FKP","Falkland Islands (Malvinas) Pound","Livre des Îles Malouines","C44","Mackenzie Global Resource Class","Catégorie Mackenzie Mondial de ressources ","Mackenzie Global Resource Class","Catégorie Mackenzie Mondial de ressources "]
["FJD","Fiji Dollar","Dollar fidjien","653","Mackenzie Global Resource Fund","Fonds de ressources mondiales Mackenzie","Mackenzie Global Resource Fund","Fonds de ressources mondiales Mackenzie"]
["GMD","Gambia Dalasi","Dalasi gambien","C17","Mackenzie Global Small Cap Class","Catégorie Mackenzie Petites capitalisations mondiales","Mackenzie Global Small Cap Class","Catégorie Mackenzie Petites capitalisations mondiales"]
["GEL","Georgia Lari","Lari géorgien","296","Mackenzie Global Small Cap Fund","Fonds de petites capitalisations mondiales Mackenzie","Mackenzie Global Small Cap Fund","Fonds de petites capitalisations mondiales Mackenzie"]
["GHS","Ghana Cedi","Cédi ghanéen","2309","Mackenzie Global Strategic Income Fund","Fonds de revenu stratégique mondial Mackenzie","Mackenzie Global Strategic Income Fund","Fonds de revenu stratégique mondial Mackenzie"]
["GIP","Gibraltar Pound","Livre de Gibaltar","5256","Mackenzie Global Sustainability and Impact Balanced Fund","Fonds équilibré de durabilité mondiale et d'impact Mackenzie","Mackenzie Global Sustainability and Impact Balanced Fund","Fonds équilibré de durabilité mondiale et d'impact Mackenzie"]
["GTQ","Guatemala Quetzal","Quetzal guatémaltèque","4710","Mackenzie Global Tactical Bond Fund","Fonds d'obligations tactique mondial Mackenzie","Mackenzie Global Tactical Bond Fund","Fonds d'obligations tactique mondial Mackenzie"]
["GGP","Guernsey Pound","Livre de Guernesey","4804","Mackenzie Global Tactical Investment Grade Bond Fund","Fonds d'obligations de catégorie investissement tactique mondial Mackenzie","Mackenzie Global Tactical Investment Grade Bond Fund","Fonds d'obligations de catégorie investissement tactique mondial Mackenzie"]
["GNF","Guinea Franc","Franc guinéen","C99","Mackenzie Gold Bullion Class","Catégorie Mackenzie Lingot d'or","Mackenzie Gold Bullion Class","Catégorie Mackenzie Lingot d'or"]
["GYD","Guyana Dollar","Dollar guyanien","5461","Mackenzie Growth ETF Portfolio","Portefeuille FNB croissance Mackenzie","Mackenzie Growth ETF Portfolio","Portefeuille FNB croissance Mackenzie"]
["HTG","Haiti Gourde","Gourde haïtienne","292","Mackenzie Growth Fund","Fonds de croissance Mackenzie","Mackenzie Growth Fund","Fonds de croissance Mackenzie"]
["HNL","Honduras Lempira","Lempira hondurien","C50","Mackenzie High Diversification Canadian Equity Class","Catégorie Mackenzie Actions canadiennes à forte diversification","Mackenzie High Diversification Canadian Equity Class","Catégorie Mackenzie Actions canadiennes à forte diversification"]
["HKD","Hong Kong Dollar","Dollar de Hong Kong","5092","Mackenzie High Diversification Emerging Markets Equity Fund","Fonds d'actions de marchés émergents à forte diversification Mackenzie","Mackenzie High Diversification Emerging Markets Equity Fund","Fonds d'actions de marchés émergents à forte diversification Mackenzie"]
["HUF","Hungary Forint","Forint hongrois","5068","Mackenzie High Diversification European Equity Fund","Fonds d’actions européennes à forte diversification Mackenzie","Mackenzie High Diversification European Equity Fund","Fonds d’actions européennes à forte diversification Mackenzie"]
["ISK","Iceland Krona","Couronne islandaise","5056","Mackenzie High Diversification Global Equity Fund","Fonds d’actions mondiales à forte diversification Mackenzie","Mackenzie High Diversification Global Equity Fund","Fonds d’actions mondiales à forte diversification Mackenzie"]
["INR","India Rupee","Rouplie indienne","5080","Mackenzie High Diversification International Equity Fund","Fonds d’actions internationales à forte diversification Mackenzie","Mackenzie High Diversification International Equity Fund","Fonds d’actions internationales à forte diversification Mackenzie"]
["IDR","Indonesia Rupiah","Roupie indonésienne","5044","Mackenzie High Diversification US Equity Fund","Fonds d'actions américaines à forte diversification Mackenzie","Mackenzie High Diversification US Equity Fund","Fonds d'actions américaines à forte diversification Mackenzie"]
["XDR","International Monetary Fund (IMF) Special Drawing Rights","Droits de tirage spéciaux du Fonds monétaire international (FMI)","291","Mackenzie Income Fund","Fonds de revenu Mackenzie","Mackenzie Income Fund","Fonds de revenu Mackenzie"]
["IRR","Iran Rial","Rial iranien","E21","Mackenzie International Equity Index ETF","FINB Actions internationales Mackenzie","Mackenzie International Equity Index ETF","FINB Actions internationales Mackenzie"]
["IQD","Iraq Dinar","Dinar irakien","E22","Mackenzie International Equity Index ETF (CAD-Hedged)","FINB Actions internationales Mackenzie (couvert en $ CA)","Mackenzie International Equity Index ETF (CAD-Hedged)","FINB Actions internationales Mackenzie (couvert en $ CA)"]
["IMP","Isle of Man Pound","Livre mannoise","4721","Mackenzie Investment Grade Floating Rate Fund","Fonds de titres de catégorie investissement à taux variable Mackenzie","Mackenzie Investment Grade Floating Rate Fund","Fonds de titres de catégorie investissement à taux variable Mackenzie"]
["ILS","Israel Shekel","Shekel israélien","C516","Mackenzie Ivy Canadian Balanced Class","Catégorie Mackenzie Ivy Canadien équilibré","Mackenzie Ivy Canadian Balanced Class","Catégorie Mackenzie Ivy Canadien équilibré"]
["JMD","Jamaica Dollar","Dollar jamaïcain","612","Mackenzie Ivy Canadian Balanced Fund","Fonds canadien équilibré Mackenzie Ivy","Mackenzie Ivy Canadian Balanced Fund","Fonds canadien équilibré Mackenzie Ivy"]
["JPY","Japan Yen","Yen japonais","613","Mackenzie Ivy Canadian Fund","Fonds canadien Mackenzie Ivy","Mackenzie Ivy Canadian Fund","Fonds canadien Mackenzie Ivy"]
["JEP","Jersey Pound","Livre de Jersey","C65","Mackenzie Ivy European Class","Catégorie Mackenzie Ivy Européen","Mackenzie Ivy European Class","Catégorie Mackenzie Ivy Européen"]
["JOD","Jordan Dinar","Dinar jordanien","C85","Mackenzie Ivy Foreign Equity Class","Catégorie Mackenzie Ivy Actions étrangères","Mackenzie Ivy Foreign Equity Class","Catégorie Mackenzie Ivy Actions étrangères"]
["KZT","Kazakhstan Tenge","Tenge kazakh","C84","Mackenzie Ivy Foreign Equity Currency Neutral Class","Catégorie Mackenzie Ivy Actions étrangères - Devises neutres","Mackenzie Ivy Foreign Equity Currency Neutral Class","Catégorie Mackenzie Ivy Actions étrangères - Devises neutres"]
["KES","Kenya Shilling","Shilling kényan","611","Mackenzie Ivy Foreign Equity Fund","Fonds d'actions étrangères Mackenzie Ivy","Mackenzie Ivy Foreign Equity Fund","Fonds d'actions étrangères Mackenzie Ivy"]
["KPW","Korea (North) Won","Won nord-coréen","C517","Mackenzie Ivy Global Balanced Class","Catégorie Mackenzie Ivy Mondial équilibré","Mackenzie Ivy Global Balanced Class","Catégorie Mackenzie Ivy Mondial équilibré"]
["KOR","Korea (South) Won","Won sud-coréen","086","Mackenzie Ivy Global Balanced Fund","Fonds mondial équilibré Mackenzie Ivy","Mackenzie Ivy Global Balanced Fund","Fonds mondial équilibré Mackenzie Ivy"]
["KWD","Kuwait Dinar","Dinar koweïtien","E14","Mackenzie Ivy Global Equity ETF","FNB d’actions mondiales Mackenzie Ivy","Mackenzie Ivy Global Equity ETF","FNB d’actions mondiales Mackenzie Ivy"]
["KGS","Kyrgyzstan Som","Som kirghize","C30","Mackenzie Ivy International Class","Catégorie Mackenzie Ivy International A","Mackenzie Ivy International Class","Catégorie Mackenzie Ivy International A"]
["LAK","Laos Kip","Kip laotien","299","Mackenzie Ivy International Fund","Fonds international Mackenzie Ivy","Mackenzie Ivy International Fund","Fonds international Mackenzie Ivy"]
["LVL","Latvia Lat","Lats letton","E10","Mackenzie Maximum Diversification All World Developed ex North America Index ETF","FINB Diversification maximale Marchés développés mondiaux ex Amérique du Nord Mackenzie","Mackenzie Maximum Diversification All World Developed ex North America Index ETF","FINB Diversification maximale Marchés développés mondiaux ex Amérique du Nord Mackenzie"]
["LBP","Lebanon Pound","Livre libanaise","E08","Mackenzie Maximum Diversification All World Developed Index ETF","FINB Diversification maximale Marchés développés mondiaux Mackenzie","Mackenzie Maximum Diversification All World Developed Index ETF","FINB Diversification maximale Marchés développés mondiaux Mackenzie"]
["LSL","Lesotho Loti","Loti lesothan","E05","Mackenzie Maximum Diversification Canada Index ETF","FINB Diversification maximale Canada Mackenzie","Mackenzie Maximum Diversification Canada Index ETF","FINB Diversification maximale Canada Mackenzie"]
["LRD","Liberia Dollar","Dollar libérien","E07","Mackenzie Maximum Diversification Developed Europe Index ETF","FINB Diversification maximale Marchés développés européens Mackenzie","Mackenzie Maximum Diversification Developed Europe Index ETF","FINB Diversification maximale Marchés développés européens Mackenzie"]
["LYD","Libya Dinar","Dinar Libyen","E09","Mackenzie Maximum Diversification Emerging Markets Index ETF","FINB Diversification maximale Marchés émergents Mackenzie","Mackenzie Maximum Diversification Emerging Markets Index ETF","FINB Diversification maximale Marchés émergents Mackenzie"]
["LTL","Lithuania Litas","Litas lithuanien","E06","Mackenzie Maximum Diversification US Index ETF","FINB Diversification maximale États-Unis Mackenzie","Mackenzie Maximum Diversification US Index ETF","FINB Diversification maximale États-Unis Mackenzie"]
["MOP","Macau Pataca","Pataca de Macau","5481","Mackenzie Moderate Growth ETF Portfolio","Portefeuille FNB croissance modérée Mackenzie","Mackenzie Moderate Growth ETF Portfolio","Portefeuille FNB croissance modérée Mackenzie"]
["MKD","Macedonia Denar","Denar macédonien","4777","Mackenzie Monthly Income Balanced Portfolio","Portefeuille équilibré de revenu mensuel Mackenzie","Mackenzie Monthly Income Balanced Portfolio","Portefeuille équilibré de revenu mensuel Mackenzie"]
["MGA","Madagascar Ariary","Ariary malgache","4788","Mackenzie Monthly Income Conservative Portfolio","Portefeuille prudent de revenu mensuel Mackenzie","Mackenzie Monthly Income Conservative Portfolio","Portefeuille prudent de revenu mensuel Mackenzie"]
["MWK","Malawi Kwacha","Kwacha malawien","5546","Mackenzie Multi-strategy Absolute Return Fund","Fonds des marchés émergents Mackenzie","Mackenzie Multi-strategy Absolute Return Fund","Fonds des marchés émergents Mackenzie"]
["MYR","Malaysia Ringgit","Ringgit malaisien","2979","Mackenzie North American Corporate Bond Fund","Fonds d'obligations de sociétés nord-américaines Mackenzie","Mackenzie North American Corporate Bond Fund","Fonds d'obligations de sociétés nord-américaines Mackenzie"]
["MVR","Maldives (Maldive Islands) Rufiyaa","Roupie des Maldives","E13","Mackenzie Portfolio Completion ETF","FNB complémentarité de portefeuille Mackenzie","Mackenzie Portfolio Completion ETF","FNB complémentarité de portefeuille Mackenzie"]
["MRO","Mauritania Ouguiya","Ouguiya mautitanien","C42","Mackenzie Precious Metals Class","Catégorie Mackenzie Métaux précieux","Mackenzie Precious Metals Class","Catégorie Mackenzie Métaux précieux"]
["MUR","Mauritius Rupee","Roupie mauricienne","6562","Mackenzie Private Canadian Focused Equity Pool","Mandat privé ciblé d’actions canadiennes Mackenzie","Mackenzie Private Canadian Focused Equity Pool","Mandat privé ciblé d’actions canadiennes Mackenzie"]
["MXN","Mexico Peso","Peso mexicain","C655","Mackenzie Private Canadian Focused Equity Pool Class","Catégorie mandat privé ciblé d’actions canadiennes Mackenzie","Mackenzie Private Canadian Focused Equity Pool Class","Catégorie mandat privé ciblé d’actions canadiennes Mackenzie"]
["MDL","Moldova Leu","Leu moldave","6573","Mackenzie Private Global Conservative Income Balanced Pool","Mandat privé équilibré de revenu mondial prudent Mackenzie","Mackenzie Private Global Conservative Income Balanced Pool","Mandat privé équilibré de revenu mondial prudent Mackenzie"]
["MNT","Mongolia Tughrik","Tugrik mongol","6580","Mackenzie Private Global Equity Pool","Mandat privé d'actions mondiales Mackenzie","Mackenzie Private Global Equity Pool","Mandat privé d'actions mondiales Mackenzie"]
["MAD","Morocco Dirham","Dirham marocain","C657","Mackenzie Private Global Equity Pool Class","Catégorie mandat privé d’actions mondiales Mackenzie","Mackenzie Private Global Equity Pool Class","Catégorie mandat privé d’actions mondiales Mackenzie"]
["MZN","Mozambique Metical","Metical mozambicain","6586","Mackenzie Private Global Fixed Income Pool","Mandat privé de revenu fixe mondial Mackenzie","Mackenzie Private Global Fixed Income Pool","Mandat privé de revenu fixe mondial Mackenzie"]
["MMK","Myanmar (Burma) Kyat","Kyat de Myanmar","6592","Mackenzie Private Global Income Balanced Pool","Mandat privé équilibré de revenu mondial Mackenzie","Mackenzie Private Global Income Balanced Pool","Mandat privé équilibré de revenu mondial Mackenzie"]
["NAD","Namibia Dollar","Dollar namibien","6570","Mackenzie Private Income Balanced Pool","Mandat privé équilibré de revenu Mackenzie","Mackenzie Private Income Balanced Pool","Mandat privé équilibré de revenu Mackenzie"]
["NPR","Nepal Rupee","Roupie népalaise","C656","Mackenzie Private Income Balanced Pool Class","Catégorie mandat privé équilibré de revenu Mackenzie","Mackenzie Private Income Balanced Pool Class","Catégorie mandat privé équilibré de revenu Mackenzie"]
["ANG","Netherlands Antilles Guilder","Florin des Antilles néerlandaises","6602","Mackenzie Private US Equity Pool","Mandat privé d'actions américaines Mackenzie","Mackenzie Private US Equity Pool","Mandat privé d'actions américaines Mackenzie"]
["NZD","New Zealand Dollar","Dollar néo-zélandais","C659","Mackenzie Private US Equity Pool Class","Catégorie mandat privé d'actions américaines Mackenzie","Mackenzie Private US Equity Pool Class","Catégorie mandat privé d'actions américaines Mackenzie"]
["NIO","Nicaragua Cordoba","Córdoba nacaraguayen","4345","Mackenzie Strategic Bond Fund","Fonds d'obligations stratégique Mackenzie","Mackenzie Strategic Bond Fund","Fonds d'obligations stratégique Mackenzie"]
["NGN","Nigeria Naira","Naira nigérien","C51","Mackenzie Strategic Income Class","Catégorie Mackenzie Revenu stratégique","Mackenzie Strategic Income Class","Catégorie Mackenzie Revenu stratégique"]
["NOK","Norway Krone","Couronne norvégienne","2238","Mackenzie Strategic Income Fund","Fonds de revenu stratégique Mackenzie","Mackenzie Strategic Income Fund","Fonds de revenu stratégique Mackenzie"]
["CNHR","Offshore Chinese Renminbi","Yuan chinois offshore","E02","Mackenzie Unconstrained Bond ETF","FNB d’obligations sans contraintes Mackenzie","Mackenzie Unconstrained Bond ETF","FNB d’obligations sans contraintes Mackenzie"]
["OMR","Oman Rial","Rial omanais","4762","Mackenzie Unconstrained Fixed Income Fund","Fonds de revenu fixe sans contraintes Mackenzie","Mackenzie Unconstrained Fixed Income Fund","Fonds de revenu fixe sans contraintes Mackenzie"]
["PKR","Pakistan Rupee","Roupie pakistanaise","1537","Mackenzie US All Cap Growth Fund","Fonds de croissance toutes capitalisations américaines Mackenzie","Mackenzie US All Cap Growth Fund","Fonds de croissance toutes capitalisations américaines Mackenzie"]
["PAB","Panama Balboa","Balboa panaméen","4732","Mackenzie US Dividend Fund","Fonds américain de dividendes Mackenzie","Mackenzie US Dividend Fund","Fonds américain de dividendes Mackenzie"]
["PGK","Papua New Guinea Kina","Kina de Papouasie Nouvelle-Guinée","C19","Mackenzie US Growth Class","Catégorie Mackenzie Croissance américaine","Mackenzie US Growth Class","Catégorie Mackenzie Croissance américaine"]
["PYG","Paraguay Guarani","Guarani paraguayen","E28","Mackenzie US High Yield Bond Index ETF (CAD-Hedged)","FINB Obligations américaines à rendement élevé Mackenzie (couvert en $ CA)","Mackenzie US High Yield Bond Index ETF (CAD-Hedged)","FINB Obligations américaines à rendement élevé Mackenzie (couvert en $ CA)"]
["PEN","Peru Nuevo Sol","Nouveau sol péruvien","E27","Mackenzie US Investment Grade Corporate Bond Index ETF (CAD-Hedged)","FINB Obligations de sociétés américaines de qualité Mackenzie (couvert en $ CA)","Mackenzie US Investment Grade Corporate Bond Index ETF (CAD-Hedged)","FINB Obligations de sociétés américaines de qualité Mackenzie (couvert en $ CA)"]
["PHP","Philippines Peso","Peso philippin","E19","Mackenzie US Large Cap Equity Index ETF","FINB Actions américaines grandes capitalisations Mackenzie","Mackenzie US Large Cap Equity Index ETF","FINB Actions américaines grandes capitalisations Mackenzie"]
["PLN","Poland Zloty","Zloty polonais","E20","Mackenzie US Large Cap Equity Index ETF (CAD-Hedged)","FINB Actions américaines grandes capitalisations Mackenzie (couvert en $ CA)","Mackenzie US Large Cap Equity Index ETF (CAD-Hedged)","FINB Actions américaines grandes capitalisations Mackenzie (couvert en $ CA)"]
["QAR","Qatar Riyal","Riyal qatari","C76","Mackenzie US Mid Cap Growth Class","Catégorie Mackenzie Croissance moyennes capitalisations américaines","Mackenzie US Mid Cap Growth Class","Catégorie Mackenzie Croissance moyennes capitalisations américaines"]
["RON","Romania New Leu","Leu roumain","C75","Mackenzie US Mid Cap Growth Currency Neutral Class","Catégorie Mackenzie Croissance moyennes capitalisations américaines - Devises neutres","Mackenzie US Mid Cap Growth Currency Neutral Class","Catégorie Mackenzie Croissance moyennes capitalisations américaines - Devises neutres"]
["RUB","Russia Ruble","Rouble russe","E26","Mackenzie US TIPS Index ETF (CAD-Hedged)","FINB TIPS américains Mackenzie (couvert en $ CA)","Mackenzie US TIPS Index ETF (CAD-Hedged)","FINB TIPS américains Mackenzie (couvert en $ CA)"]
["RWF","Rwanda Franc","Franc rwandais","4825","Mackenzie USD Global Strategic Income Fund","Fonds de revenu stratégique mondial en dollars US Mackenzie","Mackenzie USD Global Strategic Income Fund","Fonds de revenu stratégique mondial en dollars US Mackenzie"]
["SHP","Saint Helena Pound","Livre de Sainte-Hélène","4841","Mackenzie USD Global Tactical Bond Fund","Fonds d'obligations tactique mondial en dollars US Mackenzie","Mackenzie USD Global Tactical Bond Fund","Fonds d'obligations tactique mondial en dollars US Mackenzie"]
["WST","Samoa Tala","Tala de Samoa","4835","Mackenzie USD Ultra Short Duration Income Fund","Fonds de revenu à duration ultra-courte en dollars US Mackenzie","Mackenzie USD Ultra Short Duration Income Fund","Fonds de revenu à duration ultra-courte en dollars US Mackenzie"]
["STD","São Tomé and Príncipe Dobra","Dobra santoméen","2905","Symmetry Balanced Portfolio","Portefeuille équilibré Symétrie","Symmetry Balanced Portfolio","Portefeuille équilibré Symétrie"]
["SAR","Saudi Arabia Riyal","Riyal saoudien","C13","Symmetry Balanced Portfolio Class","Catégorie Portefeuille équilibré Symétrie","Symmetry Balanced Portfolio Class","Catégorie Portefeuille équilibré Symétrie"]
["SPL","Seborga Luigino","Liogino de Seborga","4444","Symmetry Conservative Income Portfolio","Portefeuille revenu prudent Symétrie","Symmetry Conservative Income Portfolio","Portefeuille revenu prudent Symétrie"]
["RSD","Serbia Dinar","Dinar serbe","C62","Symmetry Conservative Income Portfolio Class","Catégorie Portefeuille revenu prudent Symétrie","Symmetry Conservative Income Portfolio Class","Catégorie Portefeuille revenu prudent Symétrie"]
["SCR","Seychelles Rupee","Roupie seychelloise","2912","Symmetry Conservative Portfolio","Portefeuille prudent Symétrie","Symmetry Conservative Portfolio","Portefeuille prudent Symétrie"]
["SLL","Sierra Leone Leone","Leone sierra-léonais","C14","Symmetry Conservative Portfolio Class","Catégorie Portefeuille prudent Symétrie","Symmetry Conservative Portfolio Class","Catégorie Portefeuille prudent Symétrie"]
["SGD","Singapore Dollar","Dollar de Singapour","C36","Symmetry Equity Portfolio Class","Catégorie Portefeuille actions Symétrie","Symmetry Equity Portfolio Class","Catégorie Portefeuille actions Symétrie"]
["SBD","Solomon Islands Dollar","Dollar des îles Salomon","1870","Symmetry Fixed Income Portfolio","Portefeuille revenu fixe Symétrie","Symmetry Fixed Income Portfolio","Portefeuille revenu fixe Symétrie"]
["SOS","Somalia Shilling","Shilling somalien","2891","Symmetry Growth Portfolio","Portefeuille croissance Symétrie","Symmetry Growth Portfolio","Portefeuille croissance Symétrie"]
["ZAR","South Africa Rand","Rand sud-africain","C11","Symmetry Growth Portfolio Class","Catégorie Portefeuille croissance Symétrie","Symmetry Growth Portfolio Class","Catégorie Portefeuille croissance Symétrie"]
["LKR","Sri Lanka Rupee","Roupie srilankaise","2898","Symmetry Moderate Growth Portfolio","Portefeuille croissance modérée Symétrie","Symmetry Moderate Growth Portfolio","Portefeuille croissance modérée Symétrie"]
["SDG","Sudan Pound","Livre soudanaise","C12","Symmetry Moderate Growth Portfolio Class","Catégorie Portefeuille croissance modérée Symétrie","Symmetry Moderate Growth Portfolio Class","Catégorie Portefeuille croissance modérée Symétrie"]
["SRD","Suriname Dollar","Dollar de Surinam"]
["SZL","Swaziland Lilangeni","Lilangeni swazilandais"]
["SEK","Sweden Krona","Couronne suédoise"]
["CHF","Switzerland Franc","Franc suisse"]
["SYP","Syria Pound","Livre syrienne"]
["NTD","Taiwan New Dollar","Nouveau dollar de Taïwan"]
["TJS","Tajikistan Somoni","Somoni tajik"]
["TZS","Tanzania Shilling","Shilling tanzanien"]
["THB","Thailand Baht","Baht thaïlandais"]
["TOP","Tonga Pa'anga","Pa'anga tongan"]
["TTD","Trinidad and Tobago Dollar","Dollar de Trinité-et-Tobago"]
["TND","Tunisia Dinar","Dinar tunisien"]
["TRL","Turkey Lira","Livre turque"]
["TMT","Turkmenistan Manat","Manat turkmène"]
["TVD","Tuvalu Dollar","Dollar Tuvalu"]
["UGX","Uganda Shilling","Shilling ougandais"]
["UAH","Ukraine Hryvna","Hrivna ukrainienne"]
["AED","United Arab Emirates Dirham","Dirham des Émirats arabes unis"]
["GBP","United Kingdom Pound","Livre sterling"]
["USD","United States Dollar","Dollar américain"]
["UYU","Uruguay Peso","Peso de l'Uruguay"]
["UZS","Uzbekistan Som","Sum  ouzbek"]
["VUV","Vanuatu Vatu","Vatu du Vanuatu"]
["VEF","Venezuela Bolivar","Bolivar du Venezuela"]
["VND","Viet Nam Dong","Dong du Viêt-Nam"]
["YER","Yemen Rial","Rial yéménite"]
["ZMW","Zambia Kwacha","Kwacha zambien"]
["ZWD","Zimbabwe Dollar","Dollar du Zimbabwe"]
["Other","Other","Autre"]
[]
[]
["KRW"]
["TRY"]
["TWD"]

{"sheet":"Exposures","index":1,"n_rows":1514,"n_cols":4,"rows_kept":1514,"cut":false,"hidden":true,"merged":[]}
["MPower fund code","Currency","gross exposure\n(millions)","net exposure\n(millions)"]
["086","AUD",97.227159,98.976497120000005]
["086","BRL",4.1775089999999997,4.8098600799999991]
["086","CAD",192.30126682000002,773.08528208999996]
["086","CHF",0,-0.29240384999999997]
["086","CLP",0.58040099999999994,0.58040099999999994]
["086","COP",0,0.94134382999999999]
["086","EUR",114.201285,104.67172281000001]
["086","GBP",74.960030000000003,41.805361859999998]
["086","HKD",60.746578999999997,60.746578999999997]
["086","IDR",0,1.9528083999999999]
["086","INR",0,0.6033894500000001]
["086","JPY",124.43256195000001,119.95972617]
["086","KOR",18.841999999999999,21.483365620000001]
["086","MXN",11.372596,-0.57432527999999938]
["086","NOK",3.3386230000000001,-0.35567133000000006]
["086","NTD",21.528254,27.176532100000003]
["086","NZD",3.3895270000000002,-2.09075788]
["086","PEN",0,3.1493723999999994]
["086","PHP",0,1.9110388399999998]
["086","RUB",7.6974280000000004,7.6974280000000004]
["086","SEK",24.732783000000001,24.494098620000003]
["086","THB",0,3.7182325299999999]
["086","USD",934.66048223000007,400.10452057000003]
["086","ZAR",2.8791159999999998,2.5131988500000002]
["1081","CAD",1.19932762,1.19932762]
["1081","CHF",0.46747,0.46747]
["1081","EUR",3.8980143199999997,3.8980143199999997]
["1081","GBP",3.5922269300000003,3.5922269300000003]
["1081","ILS",0.34779399999999999,0.34779399999999999]
["1081","JPY",0.37713400000000002,0.37713400000000002]
["1081","KOR",0.42980699999999999,0.42980699999999999]
["1081","SEK",0.49651313000000002,0.49651313000000002]
["1081","TRL",0.109071,0.109071]
["1081","USD",13.311508999999999,13.311508999999999]
["1216","CAD",178.73846399999999,178.73846399999999]
["1216","USD",0.13190299999999999,0.13190299999999999]
["1219","CAD",93.039925999999994,93.039925999999994]
["1232","CAD",57.885776,57.885776]
["1232","USD",1.9999999999999999E-6,1.9999999999999999E-6]
["1234","CAD",28.904487,28.904487]
["1237","CAD",127.06736600000001,127.06736600000001]
["1238","AUD",2.7987410000000001,2.7987410000000001]
["1238","CAD",4.7458159999999996,4.7458159999999996]
["1238","EUR",13.07845,13.07845]
["1238","GBP",0.91264800000000001,0.91264800000000001]
["1238","HKD",5.8672469999999999,5.8672469999999999]
["1238","JPY",1.2687520000000001,1.2687520000000001]
["1238","MXN",1.018327,1.018327]
["1238","NOK",9.0000000000000002E-6,9.0000000000000002E-6]
["1238","NZD",0.79417300000000002,0.79417300000000002]
["1238","SGD",0.25805800000000001,0.25805800000000001]
["1238","USD",18.230848000000002,18.230848000000002]
["1240","CAD",4.0214099999999996E-3,4.0214099999999996E-3]
["1240","USD",6.0280265899999996,6.0280265899999996]
["1241","AUD",6.9427000000000003E-2,6.9427000000000003E-2]
["1241","CAD",0.34354299999999999,0.34354299999999999]
["1241","CHF",0.12353500000000001,0.12353500000000001]
["1241","DKK",1.4416999999999999E-2,1.4416999999999999E-2]
["1241","EUR",0.35158600000000001,0.35158600000000001]
["1241","GBP",0.15380099999999999,0.15380099999999999]
["1241","HKD",0.124748,0.124748]
["1241","ILS",1.4822E-2,1.4822E-2]
["1241","JPY",0.46307700000000002,0.46307700000000002]
["1241","NOK",4.9568000000000001E-2,4.9568000000000001E-2]
["1241","NZD",3.6631999999999998E-2,3.6631999999999998E-2]
["1241","SEK",-4.5000000000000003E-5,-4.5000000000000003E-5]
["1241","SGD",7.9762E-2,7.9762E-2]
["1241","USD",2.7430850000000002,2.7430850000000002]
["1259","AUD",0.13810800000000001,0.13810800000000001]
["1259","CAD",21.541397,21.541397]
["1259","CHF",0.25727100000000003,0.25727100000000003]
["1259","EUR",0.95972400000000002,0.95972400000000002]
["1259","GBP",1.1077619999999999,1.1077619999999999]
["1259","HKD",0.10081,0.10081]
["1259","ILS",0.10054100000000001,0.10054100000000001]
["1259","JPY",0.32135000000000002,0.32135000000000002]
["1259","KOR",8.029E-2,8.029E-2]
["1259","SEK",8.3204E-2,8.3204E-2]
["1259","SGD",0.109001,0.109001]
["1259","THB",6.8487999999999993E-2,6.8487999999999993E-2]
["1259","USD",0.12625,0.12625]
["1260","CAD",16.127931440000001,19.167975239999997]
["1260","USD",3.4932535599999999,0.45320975999999979]
["1261","AUD",0.209008,-4.6555499999999883E-3]
["1261","BRL",0.16223299999999999,0.16223299999999999]
["1261","CAD",3.4680524400000001,13.199970159999999]
["1261","CLP",1.9347E-2,1.9347E-2]
["1261","EUR",0.70544200000000001,0.15611131000000006]
["1261","JPY",0.75740300000000005,0.23406540999999997]
["1261","MXN",0.49981999999999999,8.9289899999999908E-3]
["1261","NOK",0.14410700000000001,9.147900000000082E-4]
["1261","NZD",6.7805000000000004E-2,1.91179999999993E-4]
["1261","RUB",0.24676999999999999,0.24676999999999999]
["1261","SEK",0.114812,0.114812]
["1261","USD",8.3438815599999998,0.59999271000000087]
["1261","ZAR",7.9506999999999994E-2,7.9506999999999994E-2]
["1262","BRL",0.635629,0.635629]
["1262","CAD",0.75109617999999989,19.193221019999999]
["1262","EUR",0.87653999999999999,5.1872819999999834E-2]
["1262","EGP",1.3817870000000001,1.3817870000000001]
["1262","JPY",0.159466,1.2435070000000006E-2]
["1262","MXN",0.629714,0.629714]
["1262","USD",17.551149819999999,8.0723090000003578E-2]
["1263","CAD",17.535905,17.535905]
["1264","CAD",0.139043,0.139043]
["1264","USD",15.890707000000001,15.890707000000001]
["1265","AUD",0.28349299999999999,0.28349299999999999]
["1265","CAD",0.82555900000000004,0.82555900000000004]
["1265","CHF",0.56343900000000002,0.56343900000000002]
["1265","EUR",2.036279,2.036279]
["1265","GBP",2.3241420000000002,2.3241420000000002]
["1265","HKD",0.21138899999999999,0.21138899999999999]
["1265","ILS",0.22384699999999999,0.22384699999999999]
["1265","JPY",0.68779299999999999,0.68779299999999999]
["1265","KOR",0.17333699999999999,0.17333699999999999]
["1265","SGD",0.23960799999999999,0.23960799999999999]
["1265","SEK",0.17665500000000001,0.17665500000000001]
["1265","THB",0.14610200000000001,0.14610200000000001]
["1265","USD",0.27913900000000003,0.27913900000000003]
["1266","CAD",0.11258245,0.11258245]
["1266","CHF",0.44705600000000001,0.44705600000000001]
["1266","DKK",0.409636,0.409636]
["1266","EUR",4.15918046,4.15918046]
["1266","GBP",0.40890417000000001,0.40890417000000001]
["1266","HKD",0.96542454,0.96542454]
["1266","IDR",0.29202400000000001,0.29202400000000001]
["1266","JPY",2.0132833799999998,2.0132833799999998]
["1266","SEK",0.66997499999999999,0.66997499999999999]
["1266","USD",1.406461,1.406461]
["1266","ZAR",6.0000000000000002E-6,6.0000000000000002E-6]
["1268","CAD",0.49875453999999997,0.49875453999999997]
["1268","CHF",0.167823,0.167823]
["1268","GBP",0.27515299999999998,0.27515299999999998]
["1268","HKD",0.88862114000000003,0.88862114000000003]
["1268","IDR",0.31348999999999999,0.31348999999999999]
["1268","INR",0.90225632,0.90225632]
["1268","KOR",0.88124599999999997,0.88124599999999997]
["1268","MYR",0.66708999999999996,0.66708999999999996]
["1268","MXN",2.6999999999999999E-5,2.6999999999999999E-5]
["1268","NTD",0.30079699999999998,0.30079699999999998]
["1268","THB",0.22587599999999999,0.22587599999999999]
["1268","USD",2.2898999999999998,2.2898999999999998]
["2167","CAD",4.1487150000000002,4.1487150000000002]
["1292","CAD",413.27466700000002,413.27466700000002]
["1292","USD",31.893691,31.893691]
["1360","AUD",3.0099589999999998,3.0099589999999998]
["1360","CAD",1.51582466,1.51582466]
["1360","CHF",13.962406,13.962406]
["1360","EUR",42.973278000000001,42.973278000000001]
["1360","GBP",28.065850999999999,28.065850999999999]
["1360","HKD",6.1262489999999996,6.1262489999999996]
["1360","INR",-0.34767100000000001,-0.34767100000000001]
["1360","JPY",25.704160340000001,25.704160340000001]
["1360","KOR",2.5973609999999998,2.5973609999999998]
["1360","SEK",2.5959210000000001,2.5959210000000001]
["1360","USD",8.28613,8.28613]
["1537","CAD",6.4307461899999998,6.4307461899999998]
["1537","CHF",9.8401350000000001,9.8401350000000001]
["1537","EUR",8.9403410000000001,8.9403410000000001]
["1537","GBP",3.8999999999999999E-5,3.8999999999999999E-5]
["1537","HKD",4.892614,4.892614]
["1537","USD",851.49950081000009,851.49950081000009]
["1870","CAD",244.80546100000001,253.18027700000002]
["1870","EUR",1.5089999999999999E-2,-2.0996106799999996]
["1870","GBP",1.0087E-2,-1.1275509900000003]
["1870","JPY",-1.6230000000000001E-3,-0.83741841000000017]
["1870","USD",1.7965580000000001,-2.4901239200000092]
["2238","BRL",4.3006279999999997,4.3006279999999997]
["2238","CAD",1146.4465076600002,1683.8379444600002]
["2238","CHF",32.835363000000001,32.835363000000001]
["2238","CNY",5.298044,5.298044]
["2238","DKK",8.6784859999999995,8.6784859999999995]
["2238","EUR",100.927002,97.82922554000001]
["2238","GBP",17.831755000000001,17.831755000000001]
["2238","HKD",15.254587000000001,15.254587000000001]
["2238","JPY",28.369579999999999,28.369579999999999]
["2238","NOK",4.336284,4.336284]
["2238","NTD",4.9288069999999999,4.9288069999999999]
["2238","SEK",5.2272650000000001,5.2272650000000001]
["2238","USD",859.02020334000008,324.72654299999999]
["2309","AUD",4.9345460000000001,1.8883692699999997]
["2309","BRL",13.825113999999999,14.53609943]
["2309","CAD",211.11784956,585.20610116]
["2309","CHF",60.735494000000003,60.404370010000001]
["2309","CLP",0.81256200000000001,0.81256200000000001]
["2309","CNY",9.3680830000000004,9.3680830000000004]
["2309","COP",0,1.0580393500000003]
["2309","DKK",12.877333,12.877333]
["2309","EUR",168.07632799999999,166.51043852000001]
["2309","GBP",31.673558,33.455652119999996]
["2309","HKD",30.320487,30.320487]
["2309","IDR",0,2.1938843699999997]
["2309","INR",0,0.67719856]
["2309","JPY",63.448461999999999,55.960787480000008]
["2309","KOR",0,2.9678771500000001]
["2309","MXN",21.040101,-0.43535913999999687]
["2309","NOK",12.339808,7.0023918299999997]
["2309","NTD",9.3048140000000004,15.649401560000001]
["2309","NZD",5.6629480000000001,-2.3956465099999997]
["2309","PEN",0,3.5386206799999997]
["2309","PHP",0,2.1466818399999994]
["2309","RUB",11.534679000000001,11.534679000000001]
["2309","SEK",11.992948999999999,11.722894670000001]
["2309","THB",0,4.1767344899999994]
["2309","USD",790.72039843999994,439.01883962000005]
["2309","ZAR",4.5672220000000001,4.1562155399999998]
["2421","BRL",21.918185999999999,21.918185999999999]
["2421","CAD",119.70121899,308.95875270000005]
["2421","CHF",177.85489999999999,144.22843150999998]
["2421","CNY",27.359622999999999,27.359622999999999]
["2421","DKK",37.646966999999997,37.646966999999997]
["2421","EUR",476.53760899999997,334.02699434000004]
["2421","GBP",88.42944,75.308989439999991]
["2421","HKD",89.390928000000002,89.390928000000002]
["2421","JPY",138.34844699999999,138.34844699999999]
["2421","NOK",21.771291000000002,21.771291000000002]
["2421","NTD",27.332888000000001,27.332888000000001]
["2421","SEK",23.127393999999999,23.127393999999999]
["2421","USD",1251.6808110100001,1251.6808110100001]
["2802","AUD",1.5063409999999999,1.5063409999999999]
["2802","CAD",2.2088580000000002,2.2088580000000002]
["2802","EUR",4.8182919999999996,4.8182919999999996]
["2802","GBP",2.4431669999999999,2.4431669999999999]
["2802","HKD",4.7314879999999997,4.7314879999999997]
["2802","ILS",1.9999999999999999E-6,1.9999999999999999E-6]
["2802","JPY",6.1727429999999996,6.1727429999999996]
["2802","NOK",1.9999999999999999E-6,1.9999999999999999E-6]
["2802","SEK",0.78588800000000003,0.78588800000000003]
["2802","SGD",0.76517800000000002,0.76517800000000002]
["2802","USD",23.213754999999999,23.213754999999999]
["2891","CAD",800.74881300000004,838.12757164000016]
["2891","CHF",0,3.7839862400000013]
["2891","EUR",-1.660784,2.4484323999999908]
["2891","GBP",-0.10073799999999999,10.239747090000003]
["2891","JPY",2.9012E-2,3.8040902699999957]
["2891","USD",39.363917999999998,-20.023606639999986]
["2898","CAD",2184.3379450000002,2294.2159621399996]
["2898","CHF",0,3.5823270700000003]
["2898","EUR",-2.7849430000000002,-21.244344710000025]
["2898","GBP",-0.268627,6.1950091099999991]
["2898","JPY",0.10034800000000001,-1.6218056399999856]
["2898","NOK",0,-1.86582E-3]
["2898","NZD",0,-3.6098499999999995E-3]
["2898","USD",60.889763000000002,-38.847186299999954]
["2905","AUD",-6.1580000000000003E-3,-6.1580000000000003E-3]
["2905","CAD",2250.9658570000001,2377.3079404999999]
["2905","CHF",0,-4.6532084299999985]
["2905","EUR",-0.74435300000000004,-64.512448039999995]
["2905","GBP",-7.8963000000000005E-2,-25.72330414999999]
["2905","JPY",-0.56768200000000002,-16.067584229999991]
["2905","USD",32.777130999999997,16.000594350000025]
["2912","CAD",1705.8545469999999,1815.16653511]
["2912","CHF",0,-2.9915970700000001]
["2912","EUR",-0.25553799999999999,-37.514947490000011]
["2912","GBP",0.101409,-13.158889530000001]
["2912","JPY",4.7920999999999998E-2,-9.7136908900000005]
["2912","USD",4.1357400000000002,-41.903331130000055]
["291","BRL",1.518783,1.518783]
["291","CAD",867.72297054000012,1012.26402049]
["291","CHF",12.559801999999999,12.559801999999999]
["291","CNY",1.8664320000000001,1.8664320000000001]
["291","DKK",2.9263400000000002,2.9263400000000002]
["291","EUR",34.178556,34.157888749999998]
["291","GBP",6.365386,6.365386]
["291","HKD",6.4357819999999997,6.4357819999999997]
["291","JPY",9.8588070000000005,9.8588070000000005]
["291","NOK",1.4957130000000001,1.4957130000000001]
["291","NTD",1.8942079999999999,1.8942079999999999]
["291","NZD",7.4001000000000001,6.1200370000000115E-2]
["291","SEK",1.6788639999999999,1.6788639999999999]
["291","USD",243.95731246,106.77582938999998]
["292","CAD",51.444125,67.949795850000001]
["292","DKK",0.78673199999999999,0.78673199999999999]
["292","EUR",3.4123250000000001,0.10833437000000011]
["292","GBP",5.9733429999999998,0.11405994999999926]
["292","HKD",1.2011320000000001,1.2011320000000001]
["292","JPY",0.91241799999999995,2.0996757900000027]
["292","MXN",0.77781699999999998,0.77781699999999998]
["292","NTD",0.91773199999999999,0.91773199999999999]
["292","SEK",1.492764,1.492764]
["292","USD",26.219595000000002,17.68994004]
["2946","CAD",705.33034599999996,705.33034599999996]
["2946","USD",20.621727,20.621727]
["2947","CAD",133.06558000000001,133.06558000000001]
["2947","USD",0.485018,0.485018]
["296","AUD",10.017369,10.017369]
["296","CAD",49.849659000000003,49.849659000000003]
["296","DKK",11.429921,11.429921]
["296","EUR",47.100889000000002,47.100889000000002]
["296","GBP",35.031458000000001,35.031458000000001]
["296","HKD",14.840897,14.840897]
["296","JPY",34.523308,34.523308]
["296","KOR",13.725204,13.725204]
["296","NOK",5.0112230000000002,5.0112230000000002]
["296","NTD",12.671469999999999,12.671469999999999]
["296","SEK",9.8572849999999992,9.8572849999999992]
["296","SGD",1.632995,1.632995]
["296","USD",244.654619,244.654619]
["2979","CAD",83.836192060000002,579.82992960000001]
["2979","EUR",4.907521,4.907521]
["2979","GBP",2.4146589999999999,2.4146589999999999]
["2979","USD",577.59750393999991,81.603766399999969]
["299","AUD",15.731912449999999,8.1461120399999984]
["299","CAD",2.9989176099999999,40.991772309999995]
["299","CHF",2.2134079999999998,0.94097721999999995]
["299","EUR",17.339247,12.741808669999999]
["299","GBP",25.961431000000001,17.047053469999998]
["299","HKD",13.733110999999999,9.4083721400000009]
["299","JPY",19.34492294,10.642686030000002]
["299","KOR",2.381475,1.9763776799999999]
["299","NTD",2.4418530000000001,1.36133543]
["299","SEK",2.356865,1.2466480099999999]
["299","USD",9.3999999999999994E-5,9.3999999999999994E-5]
["302","CAD",1294.6292490000001,1444.12190463]
["302","MXN",8.4800000000000001E-4,8.4800000000000001E-4]
["302","NZD",10.587816,3.4929150000000374E-2]
["302","USD",167.53189599999999,28.59212721999997]
["3069","CAD",1607.7601830000001,1607.7601830000001]
["3069","USD",3.9999999999999998E-6,3.9999999999999998E-6]
["3072","BRL",5.1285449999999999,5.1285449999999999]
["3072","CAD",2150.5445188900003,2195.84544013]
["3072","CHF",42.726095999999998,34.495537759999998]
["3072","CNY",3.914037,3.914037]
["3072","DKK",9.7281030000000008,9.7281030000000008]
["3072","EUR",114.80407099999999,80.880841610000004]
["3072","GBP",21.218644999999999,18.071511390000001]
["3072","HKD",21.664200999999998,21.664200999999998]
["3072","JPY",33.458731999999998,33.458731999999998]
["3072","NOK",5.068092,5.068092]
["3072","NTD",6.4970049999999997,6.4970049999999997]
["3072","SEK",5.6385779999999999,5.6385779999999999]
["3072","USD",304.32863111,304.32863111]
["3077","CAD",273.57128599999999,273.57128599999999]
["3077","USD",-1.0078999999999999E-2,-1.0078999999999999E-2]
["3078","CAD",242.602946,242.602946]
["3078","USD",1.1E-5,1.1E-5]
["3079","CAD",574.14040499999999,574.14040499999999]
["3079","USD",-6.5215999999999996E-2,-6.5215999999999996E-2]
["307","CAD",868.66986899999995,868.66986899999995]
["3080","CAD",369.670839,369.670839]
["3080","USD",4.2076000000000002E-2,4.2076000000000002E-2]
["3081","CAD",261.55479600000001,261.55479600000001]
["3081","USD",6.3335000000000002E-2,6.3335000000000002E-2]
["3085","CAD",145.87662968999999,145.87662968999999]
["3085","USD",15.356292310000001,15.356292310000001]
["3086","CAD",50.833955289999999,50.833955289999999]
["3086","USD",5.6096347099999999,5.6096347099999999]
["3087","CAD",88.706891999999996,88.706891999999996]
["3087","USD",9.0711220000000008,9.0711220000000008]
["3091","CAD",283.45561900000001,283.45561900000001]
["3091","USD",6.0000000000000002E-6,6.0000000000000002E-6]
["3092","CAD",292.59096199999999,292.59096199999999]
["3093","CAD",246.35729000000001,246.35729000000001]
["3093","USD",0.26097100000000001,0.26097100000000001]
["3102","CAD",150.34740500000001,150.34740500000001]
["3864","CAD",1818.26056776,1932.23668929]
["3864","NZD",5.2994180000000002,1.7064959999999962E-2]
["3864","USD",157.17873724,48.484968749999986]
["3914","AUD",1.8668262900000001,1.7641361100000001]
["3914","BRL",0.59423172000000002,0.59423172000000002]
["3914","CAD",1308.47933883,1381.4123386599999]
["3914","CHF",0.58873399999999998,1.2452680199999999]
["3914","CLP",2.6081E-2,2.6081E-2]
["3914","DKK",0.73398920999999995,0.45659198000000001]
["3914","EUR",7.4492171100000002,5.9183773200000003]
["3914","GBP",4.3845179999999999,4.44943168]
["3914","HKD",2.39153349,2.1276308400000001]
["3914","IDR",0.14937979000000001,0.14937979000000001]
["3914","ILS",0.499971,0.499971]
["3914","JPY",8.1555252500000002,8.1555252500000002]
["3914","KOR",0.53559841000000008,0.53559841000000008]
["3914","MXN",0.112695,0.112695]
["3914","MYR",0.43097999999999997,0.43097999999999997]
["3914","NOK",0.56298314999999999,0.56298314999999999]
["3914","NTD",1.39073896,1.39073896]
["3914","NZD",0.37596329000000001,0.37596329000000001]
["3914","PHP",0.131855,0.131855]
["3914","PLN",0.22626203,0.22626203]
["3914","SEK",1.66133207,1.3926307600000001]
["3914","SGD",1.0255510000000001,1.0255510000000001]
["3914","THB",0.31074299999999999,0.31074299999999999]
["3914","TRL",0.21798799999999999,0.21798799999999999]
["3914","USD",37.792254999999997,-33.418661369999995]
["3914","ZAR",0.31507040000000003,0.31507040000000003]
["3997","AUD",9.4217889199999991,5.810968850000001]
["3997","BRL",7.5337649999999998,7.5337649999999998]
["3997","CAD",730.74230092999994,907.36426348999987]
["3997","COP",3.6482869999999998,3.6482869999999998]
["3997","EUR",27.941355000000001,9.0038648200000004]
["3997","GBP",3.6351689999999999,3.6351689999999999]
["3997","IDR",8.6644590000000008,8.6644590000000008]
["3997","INR",0.31209100000000001,0.31209100000000001]
["3997","JPY",3.8034400000000002,3.8034399899999998]
["3997","MXN",2.2959999999999999E-3,2.2959999999999999E-3]
["3997","MYR",4.4296430000000004,4.4296430000000004]
["3997","NOK",7.0312710000000003,7.0312710000000003]
["3997","NZD",3.9079860000000002,3.8105733999999996]
["3997","PHP",7.7791439999999996,7.7791439999999996]
["3997","SGD",3.6946650000000001,-1.1911799999999815E-2]
["3997","USD",255.35798015,105.08831724999995]
["3998","AED",0.29247299999999998,0.29247299999999998]
["3998","BRL",1.8432080900000001,1.8432080900000001]
["3998","CAD",0.46968298999999991,0.46968298999999991]
["3998","CNY",0.93084599999999995,0.93084599999999995]
["3998","HKD",6.4156296100000008,6.4156296100000008]
["3998","IDR",9.0944999999999998E-2,9.0944999999999998E-2]
["3998","INR",1.71812674,1.71812674]
["3998","KOR",3.9386742200000002,3.9386742200000002]
["3998","MXN",0.68940641000000003,0.68940641000000003]
["3998","MYR",0.34738400000000003,0.34738400000000003]
["3998","NGN",7.5565999999999994E-2,7.5565999999999994E-2]
["3998","NTD",4.2930717699999992,4.2930717699999992]
["3998","PHP",0.53260799999999997,0.53260799999999997]
["3998","PKR",9.7599999999999996E-3,9.7599999999999996E-3]
["3998","RUB",1.2230129999999999,1.2230129999999999]
["3998","THB",0.88135399999999997,0.88135399999999997]
["3998","TRL",0.257967,0.257967]
["3998","USD",2.5818597099999998,2.5818597099999998]
["3998","ZAR",1.0727274599999999,1.0727274599999999]
["3999","AUD",5.6102559999999997,5.6102559999999997]
["3999","CAD",0.78421882000000009,0.78421882000000009]
["3999","EUR",5.7975580000000004,5.7975580000000004]
["3999","GBP",4.2517040000000001,4.2517040000000001]
["3999","HKD",3.6324040000000002,3.6324040000000002]
["3999","JPY",6.6136041799999994,6.6136041799999994]
["3999","KOR",1.0376430000000001,1.0376430000000001]
["3999","SEK",1.3086089999999999,1.3086089999999999]
["3999","USD",41.053719999999998,41.053719999999998]
["4324","CAD",34.160767209999996,905.29178725000008]
["4324","EUR",7.0277859999999999,1.5523800000008196E-3]
["4324","USD",894.57325878999995,30.468472370000001]
["4345","CAD",266.79826899,319.19203779000003]
["4345","EUR",5.8486000000000003E-2,-5.6330999999999764E-4]
["4345","NZD",0.70282900000000004,-4.1538000000000463E-4]
["4345","USD",57.470657010000004,5.839181900000006]
["4444","CAD",1379.1297010000001,1435.2249347300001]
["4444","CHF",0,-1.6810605300000003]
["4444","EUR",-0.306394,-22.989318019999995]
["4444","GBP",0.11548899999999999,-7.5598284599999932]
["4444","JPY",3.3950000000000001E-2,-5.2743062899999993]
["4444","USD",5.4897799999999997,-13.257895429999976]
["4710","AUD",3.7797429999999999,0.64188602999999933]
["4710","BRL",2.2712669999999999,2.5235521500000004]
["4710","CAD",64.669744080000001,187.07679719000001]
["4710","CHF",0,-0.11883078]
["4710","CLP",0.29020099999999999,0.29020099999999999]
["4710","COP",0,0.37731550000000003]
["4710","EUR",3.7998349999999999,2.38212322]
["4710","GBP",0.62878000000000001,1.2181500199999999]
["4710","IDR",0,0.78279879000000008]
["4710","INR",0,0.24172482999999995]
["4710","JPY",8.5472850000000005,3.0968388300000003]
["4710","KOR",0,1.0583476899999997]
["4710","MXN",9.7622599999999995,-0.11627052000000142]
["4710","NOK",1.58518,-0.14312385000000008]
["4710","NTD",0,2.2632230899999999]
["4710","NZD",3.5767180000000001,-0.86926875000000003]
["4710","PEN",0,1.2621080400000002]
["4710","PHP",0,0.76648711999999997]
["4710","RUB",4.0438409999999996,4.0438409999999996]
["4710","SEK",3.0245060000000001,2.9276683299999999]
["4710","THB",0,1.4899130299999999]
["4710","USD",104.75029092,-0.3192906899999976]
["4710","ZAR",1.6110180000000001,1.46447773]
["4721","CAD",40.026722729999996,50.273729309999993]
["4721","USD",10.23867027,-8.3363100000005217E-3]
["4732","CAD",0.35177599999999998,33.139092980000001]
["4732","USD",167.80976100000001,135.02244402000002]
["4762","AUD",3.6460129999999999,-5.8094800000000744E-2]
["4762","BRL",1.906242,1.906242]
["4762","CAD",919.56415898,2191.5634842499999]
["4762","EUR",5.3090739999999998,-1.5883189999999478E-2]
["4762","MXN",8.0031920000000003,0.1616236400000006]
["4762","RUB",10.182446000000001,10.182446000000001]
["4762","USD",1319.9867870200001,64.8580950999999]
["4762","ZAR",1.247212,1.247212]
["4773","AUD",18.972581999999999,18.972581999999999]
["4773","CAD",113.53983843,113.53983843]
["4773","CHF",30.890781,30.890781]
["4773","DKK",8.0933290000000007,8.0933290000000007]
["4773","EUR",77.560379999999995,77.560379999999995]
["4773","GBP",35.163691,35.163691]
["4773","HKD",14.342506,14.342506]
["4773","ILS",1.340646,1.340646]
["4773","JPY",56.467218000000003,56.467218000000003]
["4773","MYR",0.30133300000000002,0.30133300000000002]
["4773","NOK",2.2113700000000001,2.2113700000000001]
["4773","NZD",1.4648319999999999,1.4648319999999999]
["4773","SEK",18.521443000000001,18.521443000000001]
["4773","SGD",0.52621200000000001,0.52621200000000001]
["4773","USD",304.10202757000002,304.10202757000002]
["4773","ZAR",1.592403,1.592403]
["4775","AED",0.35121000000000002,0.35121000000000002]
["4775","AUD",2.4493960000000001,2.4493960000000001]
["4775","BRL",9.3032730000000008,9.3032730000000008]
["4775","CAD",3.048489,3.048489]
["4775","CHF",2.185025,2.185025]
["4775","CLP",4.5943999999999999E-2,4.5943999999999999E-2]
["4775","COP",2.6023000000000001E-2,2.6023000000000001E-2]
["4775","CZK",6.6889999999999996E-3,6.6889999999999996E-3]
["4775","DKK",0.94041399999999997,0.94041399999999997]
["4775","EUR",14.134558999999999,14.134558999999999]
["4775","GBP",2.7011349999999998,2.7011349999999998]
["4775","HKD",39.306646999999998,39.306646999999998]
["4775","HUF",0.61248400000000003,0.61248400000000003]
["4775","IDR",2.2934079999999999,2.2934079999999999]
["4775","INR",1.3046E-2,1.3046E-2]
["4775","JPY",7.5044170000000001,7.5044170000000001]
["4775","KOR",16.703861,16.703861]
["4775","MXN",2.8502290000000001,2.8502290000000001]
["4775","MYR",3.172831,3.172831]
["4775","NOK",0.319525,0.319525]
["4775","NTD",9.4166109999999996,9.4166109999999996]
["4775","NZD",0.28840100000000002,0.28840100000000002]
["4775","PHP",1.438974,1.438974]
["4775","PLN",2.2297760000000002,2.2297760000000002]
["4775","QAR",0.68739099999999997,0.68739099999999997]
["4775","RUB",1.062665,1.062665]
["4775","SEK",1.1567149999999999,1.1567149999999999]
["4775","SGD",0.29815700000000001,0.29815700000000001]
["4775","THB",3.4021379999999999,3.4021379999999999]
["4775","TRL",0.97510399999999997,0.97510399999999997]
["4775","USD",45.399892999999999,45.399892999999999]
["4775","ZAR",5.9279190000000002,5.9279190000000002]
["4777","CAD",743.13537099999996,743.13537099999996]
["4787","AUD",18.47749,18.47749]
["4787","CAD",435.76548600000001,513.12924268999996]
["4787","CHF",62.657437999999999,62.657437999999999]
["4787","DKK",15.318346999999999,15.318346999999999]
["4787","EUR",68.421931000000001,68.421931000000001]
["4787","GBP",50.412975000000003,50.412975000000003]
["4787","HKD",14.972111999999999,14.972111999999999]
["4787","JPY",49.375208000000001,49.375208000000001]
["4787","SEK",11.249847000000001,11.249847000000001]
["4787","SGD",1.384158,1.384158]
["4787","USD",700.843209,623.47945230999994]
["4787","ZAR",1.9095000000000001E-2,1.9095000000000001E-2]
["4788","CAD",491.01055500000001,491.01055500000001]
["4798","AUD",13.353793,-0.17974761999999919]
["4798","CAD",431.44261499999999,539.10317111000006]
["4798","EUR",0.65696600000000005,0.65696600000000005]
["4798","GBP",27.781243,0.18043001000000164]
["4798","USD",68.784699000000003,2.258496499999985]
["4804","AUD",1.3944529999999999,0.1985026200000001]
["4804","BRL",0.77060899999999999,0.80992616999999989]
["4804","CAD",21.66130248,61.646042619999996]
["4804","CHF",0,-3.7384970000000003E-2]
["4804","CLP",8.7059999999999998E-2,8.7059999999999998E-2]
["4804","COP",0,5.8347750000000011E-2]
["4804","EUR",1.750966,0.70482477999999993]
["4804","GBP",0.52485999999999999,0.38601711999999999]
["4804","IDR",0,0.12193416999999999]
["4804","INR",0,3.6904550000000001E-2]
["4804","JPY",5.130979,1.09472171]
["4804","KOR",0,0.16550757000000002]
["4804","MXN",2.0858750000000001,1.3465300000002607E-3]
["4804","NOK",0.72858800000000001,-4.6073579999999961E-2]
["4804","NTD",0,0.35293587999999998]
["4804","NZD",1.6466689999999999,-0.2717326699999999]
["4804","PEN",0,0.19659004000000002]
["4804","PHP",0,0.11911624000000003]
["4804","RUB",1.3616250000000001,1.3616250000000001]
["4804","SEK",0.68957999999999997,0.65957396000000001]
["4804","THB",0,0.23230764999999998]
["4804","USD",31.226545519999998,1.2035635199999959]
["4804","ZAR",0.52925299999999997,0.50670833999999998]
["4825","AUD",0.34606799999999999,7.0340099999999975E-2]
["4825","BRL",0.49223299999999998,0.51960810000000002]
["4825","CAD",5.9977355599999997,2.3859349999999627E-2]
["4825","CHF",1.9019919999999999,1.88880808]
["4825","CLP",2.9389999999999999E-2,2.9389999999999999E-2]
["4825","COP",0,4.1364050000000013E-2]
["4825","DKK",0.42051699999999997,0.42051699999999997]
["4825","EUR",6.1632689999999997,5.3626676099999999]
["4825","GBP",1.189611,1.12070841]
["4825","HKD",0.98236800000000002,0.98236800000000002]
["4825","IDR",0,8.4839380000000006E-2]
["4825","INR",0,2.6629660000000003E-2]
["4825","JPY",2.307185,1.7798383500000001]
["4825","KOR",0,0.11459546000000002]
["4825","MXN",1.1046180000000001,-1.1080799999999814E-2]
["4825","NOK",0.45567099999999999,0.22186436000000001]
["4825","NTD",0.29068899999999998,0.53598511999999987]
["4825","NZD",0.404727,-9.262163000000001E-2]
["4825","PEN",0,0.13737617000000002]
["4825","PHP",0,8.2608460000000022E-2]
["4825","RUB",0.42253600000000002,0.42253600000000002]
["4825","SEK",0.68744300000000003,0.58449415999999998]
["4825","THB",0,0.16152619000000004]
["4825","USD",29.811774440000001,38.515412210000008]
["4825","ZAR",0.17141700000000001,0.15561021]
["4835","CAD",2.9188489999999998,-5.0609799999999814E-3]
["4835","EUR",-1.2999999999999999E-5,-1.2999999999999999E-5]
["4835","USD",7.8474789999999999,10.771388980000001]
["4841","AUD",0.102227,3.1715710000000022E-2]
["4841","BRL",9.2420000000000002E-2,0.10486323]
["4841","CAD",1.8380360200000001,-0.9108130299999998]
["4841","CHF",0,-6.08488E-3]
["4841","CLP",1.4695E-2,1.4695E-2]
["4841","COP",0,1.7727450000000006E-2]
["4841","EUR",0.208978,6.799315000000003E-2]
["4841","GBP",6.4880999999999994E-2,5.910478999999999E-2]
["4841","IDR",0,3.7470730000000001E-2]
["4841","INR",0,1.1212490000000002E-2]
["4841","JPY",0.23150999999999999,6.3277959999999994E-2]
["4841","KOR",0,5.0456210000000008E-2]
["4841","MXN",0.43557000000000001,-5.2877800000000284E-3]
["4841","NOK",0.109458,-6.2491300000000046E-3]
["4841","NTD",0,0.10861699]
["4841","NZD",0.12875500000000001,-4.1261149999999996E-2]
["4841","PEN",0,5.9728770000000007E-2]
["4841","PHP",0,3.7370489999999992E-2]
["4841","RUB",0.18,0.18]
["4841","SEK",0.10358199999999999,9.9438109999999996E-2]
["4841","THB",0,7.1641999999999983E-2]
["4841","USD",8.810523980000001,12.282263670000003]
["4841","ZAR",7.1982000000000004E-2,6.4737219999999998E-2]
["4853","CAD",0.67071698999999996,0.67071698999999996]
["4853","EUR",1.4456880000000001,1.4456880000000001]
["4853","GBP",1.8002670000000001,1.8002670000000001]
["4853","USD",173.01237900999999,173.01237900999999]
["4855","AUD",-1.575E-3,-1.575E-3]
["4855","CAD",212.54503647999999,384.77275846000003]
["4855","EUR",0.53578700000000001,-18.064624949999999]
["4855","GBP",1.2429267099999999,1.2429267099999999]
["4855","HKD",0.37698999999999999,0.37698999999999999]
["4855","ILS",1.3060000000000001E-3,1.3060000000000001E-3]
["4855","JPY",1.1017000000000001E-2,1.1017000000000001E-2]
["4855","NOK",0,18.600411949999998]
["4855","NTD",0.34337899999999999,0.34337899999999999]
["4855","PLN",3.9174630000000001,3.9174630000000001]
["4855","USD",478.76613881000003,306.53841682999996]
["5014","AUD",25.097359000000001,25.097359000000001]
["5014","BRL",5.2469999999999999E-3,5.2469999999999999E-3]
["5014","CAD",237.39713900000001,237.39713900000001]
["5014","CHF",30.965692000000001,30.965692000000001]
["5014","DKK",6.5834000000000004E-2,6.5834000000000004E-2]
["5014","EUR",104.468189,104.468189]
["5014","GBP",38.693807,38.693807]
["5014","HKD",56.069876000000001,56.069876000000001]
["5014","JPY",28.363679999999999,42.085774840000006]
["5014","KOR",3.1000000000000001E-5,3.1000000000000001E-5]
["5014","MXN",4.1051679999999999,4.1051679999999999]
["5014","MYR",6.0217390000000002,6.0217390000000002]
["5014","NOK",1.79477,1.79477]
["5014","NTD",3.4600000000000001E-4,3.4600000000000001E-4]
["5014","NZD",1.962496,1.962496]
["5014","PHP",1.3899999999999999E-4,1.3899999999999999E-4]
["5014","SEK",14.472307000000001,14.472307000000001]
["5014","SGD",0.93253299999999995,0.93253299999999995]
["5014","USD",522.68856700000003,508.96647216000002]
["5014","ZAR",8.2830209999999997,8.2830209999999997]
["5025","CAD",0.29139560000000003,0.29139560000000003]
["5025","USD",81.418095399999984,81.418095399999984]
["5026","AUD",6.8190010000000001,6.8190010000000001]
["5026","CAD",3.9252370000000001,3.9252370000000001]
["5026","CHF",8.1984329999999996,8.1984329999999996]
["5026","EUR",50.326813000000001,50.326813000000001]
["5026","GBP",31.976728999999999,31.976728999999999]
["5026","HKD",3.082897,3.082897]
["5026","KOR",7.7573210000000001,7.7573210000000001]
["5026","NOK",3.453309,3.453309]
["5026","SEK",12.561691,12.561691]
["5026","USD",40.832372999999997,40.832372999999997]
["5027","AUD",2.68255,2.68255]
["5027","CAD",8.2180359999999997,8.2180359999999997]
["5027","EUR",32.123013,32.123013]
["5027","GBP",9.9890460000000001,9.9890460000000001]
["5027","JPY",20.286201999999999,20.286201999999999]
["5027","USD",32.052765000000001,32.052765000000001]
["5044","CAD",49.462687000000003,49.462687000000003]
["5044","USD",6.2610000000000001E-3,6.2610000000000001E-3]
["5056","CAD",28.159711000000001,28.159711000000001]
["5056","CHF",9.9999999999999995E-7,9.9999999999999995E-7]
["5056","EUR",8.1499999999999997E-4,8.1499999999999997E-4]
["5056","GBP",1.91E-3,1.91E-3]
["5056","JPY",5.1910000000000003E-3,5.1910000000000003E-3]
["5056","USD",2.7789999999999998E-3,2.7789999999999998E-3]
["5068","CAD",2.9342239999999999,2.9342239999999999]
["5080","CAD",23.953295000000001,23.953295000000001]
["5092","CAD",6.4733700000000001,6.4733700000000001]
["5092","USD",6.9319999999999998E-3,6.9319999999999998E-3]
["5093","BRL",0.40558300000000003,0.40558300000000003]
["5093","CAD",32.649731209999999,139.01776724999999]
["5093","EUR",3.2382209999999998,-3.6978700000000184E-2]
["5093","GBP",2.326689,5.3379459999999962E-2]
["5093","MXN",2.8158259999999999,5.6952220000000206E-2]
["5093","RUB",1.7637529999999999,1.7637529999999999]
["5093","USD",115.91473979000001,17.854086770000009]
["5093","ZAR",0.25377899999999998,0.25377899999999998]
["5213","CAD",100.403704,139.71744357]
["5213","EUR",37.255451000000001,-0.28084481000000239]
["5213","USD",1.7860929999999999,8.6492399999999903E-3]
["5218","CAD",2.1515749999999998,2.1515749999999998]
["5218","CHF",106.449512,106.449512]
["5218","CNY",45.862538000000001,45.862538000000001]
["5218","DKK",36.870443999999999,36.870443999999999]
["5218","EUR",495.98638599999998,495.98638599999998]
["5218","GBP",63.254174999999996,63.254174999999996]
["5218","HKD",22.259961000000001,22.259961000000001]
["5218","JPY",71.481938,71.481938]
["5218","USD",53.915564000000003,53.915564000000003]
["5253","CAD",27.747121,27.747121]
["5256","AUD",0.48825001000000001,0.14724141000000016]
["5256","CAD",3.7658862100000001,11.504343159999999]
["5256","CHF",0.26297535999999999,0.25629946999999997]
["5256","DKK",3.9309999999999996E-3,3.9309999999999996E-3]
["5256","EUR",2.7373356800000002,2.5691257300000001]
["5256","GBP",0.76420420999999994,0.82561053999999989]
["5256","HKD",0.48821782000000002,0.48821782000000002]
["5256","IDR",0.10677122,0.10677122]
["5256","JPY",1.4282868400000002,1.2773077399999999]
["5256","KOR",0.12465091,0.12465091]
["5256","NOK",0.144791,-6.2754900000000198E-3]
["5256","NZD",0.132463,-4.1593690000000003E-2]
["5256","SEK",0.28862988000000001,0.28317422999999997]
["5256","USD",14.07420486,7.2717939499999984]
["5279","AUD",0.226105,0.226105]
["5279","CAD",0.70586400000000005,0.70586400000000005]
["5279","CHF",2.5357999999999999E-2,2.5357999999999999E-2]
["5279","DKK",2.9951999999999999E-2,2.9951999999999999E-2]
["5279","EUR",0.90896299999999997,0.90896299999999997]
["5279","GBP",0.14874599999999999,0.14874599999999999]
["5279","HKD",4.6766000000000002E-2,4.6766000000000002E-2]
["5279","ILS",8.6870000000000003E-3,8.6870000000000003E-3]
["5279","NOK",3.8545000000000003E-2,3.8545000000000003E-2]
["5279","NZD",9.2800000000000001E-3,9.2800000000000001E-3]
["5279","SEK",0.223854,0.223854]
["5279","SGD",7.4019999999999997E-3,7.4019999999999997E-3]
["5279","USD",8.9794710000000002,8.9794710000000002]
["5299","CAD",0.48369400000000001,0.48369400000000001]
["5299","CNY",21.840097,21.840097]
["5299","HKD",8.0932189999999995,8.0932189999999995]
["5299","USD",2.7151640000000001,2.7151640000000001]
["5401","CAD",37.216894000000003,37.552265559999995]
["5401","CHF",0,3.4028699999999995E-2]
["5401","EUR",0,-0.51992125999999994]
["5401","GBP",0,-2.1723889999999985E-2]
["5401","JPY",0,0.20911125999999994]
["5401","USD",0,-3.6866369999999878E-2]
["5421","CAD",12.589682,12.929056390000001]
["5421","EUR",0,-0.17115237999999999]
["5421","GBP",0,-4.2421450000000006E-2]
["5421","JPY",0,-6.3798800000000044E-3]
["5421","USD",0,-0.11942067999999999]
["5441","CAD",29.491413000000001,30.481282520000001]
["5441","CHF",0,6.1601370000000003E-2]
["5441","EUR",0,-0.30792735999999998]
["5441","GBP",0,-1.4539609999999986E-2]
["5441","JPY",0,4.7296269999999987E-2]
["5441","USD",0,-0.77630018999999995]
["5461","CAD",51.620234000000004,58.446687470000001]
["5461","CHF",0,0.16368747]
["5461","EUR",0,-1.5638773100000001]
["5461","GBP",0,-0.30362120999999997]
["5461","JPY",0,0.18216336000000011]
["5461","USD",0,-5.3048057799999997]
["5481","CAD",43.092446000000002,46.476305320000002]
["5481","CHF",0,7.1957929999999989E-2]
["5481","EUR",0,-1.02808955]
["5481","GBP",0,-0.21860728000000001]
["5481","JPY",0,0.12978676]
["5481","USD",0,-2.3389071799999996]
["5501","AED",2.7322350000000002,2.7322350000000002]
["5501","BRL",14.734095119999999,14.734095119999999]
["5501","CAD",0.84312839000000106,0.84312839000000106]
["5501","CNY",7.7425011799999996,7.7425011799999996]
["5501","EGP",7.2533E-2,7.2533E-2]
["5501","HKD",51.542064060000001,51.542064060000001]
["5501","IDR",0.759822,0.759822]
["5501","INR",13.68885715,13.68885715]
["5501","KOR",31.53484847,31.53484847]
["5501","MXN",5.3292881100000002,5.3292881100000002]
["5501","MYR",2.9127559999999999,2.9127559999999999]
["5501","NGN",0.69256700000000004,0.69256700000000004]
["5501","NTD",34.750445339999999,34.750445339999999]
["5501","PKR",7.6825000000000004E-2,7.6825000000000004E-2]
["5501","PHP",4.1501766499999997,4.1501766499999997]
["5501","RUB",9.4422462300000003,9.4422462300000003]
["5501","THB",6.9315129999999998,6.9315129999999998]
["5501","TRL",2.074951,2.074951]
["5501","USD",23.871953899999998,23.871953899999998]
["5501","ZAR",8.4762833999999998,8.4762833999999998]
["5515","AED",0.26371800000000001,0.26371800000000001]
["5515","BRL",4.3391755400000003,4.3391755400000003]
["5515","CAD",0.62699590999999999,0.62699590999999999]
["5515","CNY",2.4312279999999999,2.4312279999999999]
["5515","COP",0.36063659000000003,0.36063659000000003]
["5515","EUR",5.6661000000000003E-2,5.6661000000000003E-2]
["5515","HKD",16.610545819999999,16.610545819999999]
["5515","IDR",0.66691100000000003,0.66691100000000003]
["5515","INR",4.1162065999999999,4.1162065999999999]
["5515","KOR",9.35669532,9.35669532]
["5515","MXN",1.2375579999999999,1.2375579999999999]
["5515","MYR",0.78451300000000002,0.78451300000000002]
["5515","NTD",9.7457791,9.7457791]
["5515","PKR",0.123998,0.123998]
["5515","PHP",1.4526870000000001,1.4526870000000001]
["5515","PLN",0.500305,0.500305]
["5515","RUB",3.1961242000000003,3.1961242000000003]
["5515","THB",1.811512,1.811512]
["5515","TRL",0.53608199999999995,0.53608199999999995]
["5515","USD",6.8371409999999999,6.8371409999999999]
["5515","ZAR",2.3112719199999998,2.3112719199999998]
["5517","AED",0.28791099999999997,0.28791099999999997]
["5517","BRL",9.2821987899999989,9.2821987899999989]
["5517","CAD",0.55336965000000016,0.55336965000000016]
["5517","CLP",0.18489606,0.18489606]
["5517","CNY",2.9147159999999999,2.9147159999999999]
["5517","EGP",0.53537599999999996,0.53537599999999996]
["5517","EUR",0.36180200000000001,0.36180200000000001]
["5517","HKD",8.9641956199999999,8.9641956199999999]
["5517","IDR",1.121875,1.121875]
["5517","INR",11.470058799999999,11.470058799999999]
["5517","KOR",16.85605241,16.85605241]
["5517","MAD",8.5392999999999997E-2,8.5392999999999997E-2]
["5517","MXN",1.9149882899999999,1.9149882899999999]
["5517","MYR",0.62619381000000007,0.62619381000000007]
["5517","NGN",0.27123599999999998,0.27123599999999998]
["5517","NTD",22.940832099999998,22.940832099999998]
["5517","PHP",1.5394701399999999,1.5394701399999999]
["5517","PKR",1.1303840000000001,1.1303840000000001]
["5517","PLN",0.92588360999999997,0.92588360999999997]
["5517","RUB",0.68299100000000001,0.68299100000000001]
["5517","THB",5.2486820999999999,5.2486820999999999]
["5517","TRL",1.6137031499999999,1.6137031499999999]
["5517","USD",4.3728684699999993,4.3728684699999993]
["5517","ZAR",4.4171440000000004,4.4171440000000004]
["5519","CAD",7.0270000000000003E-3,7.0270000000000003E-3]
["5519","USD",15.374954000000001,15.374954000000001]
["5546","AUD",-0.48749191000000003,10.534137469999999]
["5546","BRL",0,5.3612817800000032]
["5546","CAD",168.00720633,252.25918400999998]
["5546","CHF",0.10899709999999997,-0.11385651000000351]
["5546","COP",0,0.22172147999999997]
["5546","DKK",0.18079700000000001,0.18079700000000001]
["5546","EUR",0.91645416000000002,-10.73911348]
["5546","GBP",-1.6921330000000001,-5.0557519499999994]
["5546","HKD",1.5363990000000001,-2.0605081300000001]
["5546","IDR",0,3.1582168299999993]
["5546","ILS",1.1900000000000001E-4,-6.639463469999999]
["5546","INR",0,9.1176410699999959]
["5546","JPY",46.424766409999997,-8.4507919900000026]
["5546","KOR",0,-9.6012601700000015]
["5546","MXN",1.0011829999999999,6.2328950599999997]
["5546","MYR",0.10835500000000001,0.10835500000000001]
["5546","NOK",-8.9542999999999998E-2,0.11972416000000015]
["5546","NTD",0,1.3291600100000001]
["5546","NZD",0.15301799999999999,-2.6403124299999998]
["5546","PEN",0,0.74311034000000009]
["5546","PHP",0,0.45057013000000007]
["5546","PLN",0,-3.2790216599999997]
["5546","SEK",0.63162099999999999,6.0931982099999988]
["5546","SGD",-0.25548008999999999,-4.9125894699999995]
["5546","THB",0,0.87508372999999984]
["5546","TRL",0,4.0685271099999989]
["5546","USD",31.514882,-4.2682308599999841]
["5546","ZAR",1.5488120000000001,6.5152587300000002]
["5782","AUD",0.108404,0.108404]
["5782","CAD",3.0527435400000003,3.0527435400000003]
["5782","EUR",5.5502733300000004,5.5502733300000004]
["5782","GBP",0.27839199999999997,0.27839199999999997]
["5782","JPY",1.317672,1.317672]
["5782","NOK",0.307838,0.307838]
["5782","USD",7.88338713,7.88338713]
["5937","CAD",45.782212319999999,66.706645269999996]
["5937","CHF",1.9703887499999999,1.9703887499999999]
["5937","EUR",17.685290070000001,8.9178810199999994]
["5937","GBP",3.6030787799999997,3.50095942]
["5937","HKD",3.8005330000000002,3.8005330000000002]
["5937","SEK",1.38005278,1.38005278]
["5937","USD",47.393267299999998,35.338362759999995]
["5960","AUD",-5.0299999999999997E-4,0.18378119000000001]
["5960","BRL",0,2.2935019999999997E-2]
["5960","CAD",46.383817999999998,47.80182276]
["5960","CHF",5.6842999999999998E-2,2.6133919999999998E-2]
["5960","COP",0,3.111881E-2]
["5960","EUR",-7.9629999999999996E-3,-0.15338801000000002]
["5960","GBP",2.1979999999999999E-3,0.31775829999999999]
["5960","IDR",0,6.608646E-2]
["5960","INR",0,2.02975E-2]
["5960","JPY",0,-0.35366702]
["5960","KOR",0,9.007214999999999E-2]
["5960","MXN",0,-2.8586759999999996E-2]
["5960","NOK",0,-3.7223249999999999E-2]
["5960","NTD",0,0.19211533999999997]
["5960","NZD",0,-0.21780720000000001]
["5960","PEN",0,0.10615862000000001]
["5960","PHP",0,6.4737079999999989E-2]
["5960","SEK",0,-2.45504E-2]
["5960","THB",0,0.12663388]
["5960","USD",1.232742,-0.55515395000000067]
["5960","ZAR",0,-1.2139440000000003E-2]
["5968","AUD",1.0232319999999999,1.0232319999999999]
["5968","CAD",1.278362,1.278362]
["5968","CHF",8.7438000000000002E-2,8.7438000000000002E-2]
["5968","DKK",0.59997400000000001,0.59997400000000001]
["5968","EUR",3.8352539999999999,3.8352539999999999]
["5968","GBP",1.8247549999999999,1.8247549999999999]
["5968","HKD",0.25751499999999999,0.25751499999999999]
["5968","JPY",2.3084479999999998,2.3084479999999998]
["5968","SEK",0.95177800000000001,0.95177800000000001]
["5968","USD",12.337524,12.337524]
["5976","AUD",-8.6858000000000005E-2,34.62960657]
["5976","BRL",0,12.257716780000001]
["5976","CAD",109.60487918999999,115.39490566000001]
["5976","CHF",3.9944E-2,3.9923079999998209E-2]
["5976","EUR",0.31393399999999999,-20.894792059999993]
["5976","GBP",-7.7684000000000003E-2,-17.012752679999998]
["5976","HKD",-2.9045000000000001E-2,-2.9045000000000001E-2]
["5976","IDR",0,7.1750731200000004]
["5976","ILS",0,-22.531681840000001]
["5976","INR",0,24.167492039999996]
["5976","JPY",0.11902,-9.9740220900000018]
["5976","KOR",0,-33.881601800000006]
["5976","MXN",7.3039000000000007E-2,15.865776419999998]
["5976","NOK",0,1.2490351599999998]
["5976","NZD",0,-5.7269407000000001]
["5976","PLN",0,-7.3956701400000018]
["5976","SEK",-5.5034E-2,14.314766239999994]
["5976","SGD",0,-8.1278819200000001]
["5976","TRL",0,11.822734120000002]
["5976","USD",5.4732168099999994,-8.0247163000000423]
["5976","ZAR",6.3056000000000001E-2,12.120543339999999]
["5986","CAD",23.676568,23.676568]
["5986","EUR",0.75398100000000001,0.75398100000000001]
["5986","GBP",0.14680099999999999,0.14680099999999999]
["5986","USD",1.079828,1.079828]
["5985","CAD",59.475580000000001,59.475580000000001]
["5985","USD",1.095075,1.095075]
["5988","CAD",17.348236789999998,23.485653850000002]
["5988","USD",24.75716121,18.619744149999999]
["6100","CAD",4.2977980000000002,4.2977980000000002]
["6101","CAD",13.096633000000001,13.096633000000001]
["6103","CAD",6.6476063200000004,6.6476063200000004]
["6103","USD",0.68287368000000004,0.68287368000000004]
["6106","CAD",2.3308500000000024E-3,2.3308500000000058E-3]
["6106","EUR",3.2874E-2,3.8484599999999993E-3]
["6106","GBP",3.9853E-2,-4.3509820000000005E-2]
["6106","USD",4.20296615,4.3215550900000004]
["6107","CAD",-3.5084999999999999E-3,-3.5084999999999999E-3]
["6107","USD",10.1565125,10.1565125]
["8003","AUD",7.2300000000000001E-4,0.99636120000000006]
["8003","EUR",40.046463000000003,39.517236109999999]
["8003","GBP",7.273625,7.3034699000000005]
["8003","JPY",2.047234,2.03492278]
["8003","USD",104.1907125,103.70676751000001]
["8005","AUD",14.238924000000001,14.238924000000001]
["8005","CHF",11.79362897,11.79362897]
["8005","DKK",3.9773610000000001,3.9773610000000001]
["8005","EUR",34.003401619999998,34.003401619999998]
["8005","GBP",17.290835999999999,17.290835999999999]
["8005","HKD",2.9077276699999999,2.9077276699999999]
["8005","ILS",1.434809,1.434809]
["8005","JPY",31.917340129999999,31.917340129999999]
["8005","KOR",0.39338899999999999,0.39338899999999999]
["8005","NZD",0.72401300000000002,0.72401300000000002]
["8005","SEK",3.59248236,3.59248236]
["8005","SGD",2.611971,2.611971]
["8005","USD",3.6374503599999999,3.6374503599999999]
["8006","AUD",2.23964724,2.23964724]
["8006","CHF",0.6856455600000001,0.6856455600000001]
["8006","DKK",0.14263000000000001,0.14263000000000001]
["8006","EUR",5.1442318600000005,5.1442318600000005]
["8006","GBP",3.5663661699999998,3.5663661699999998]
["8006","HKD",0.64273427999999999,0.64273427999999999]
["8006","ILS",0.44775599999999999,0.44775599999999999]
["8006","JPY",6.8789091000000004,6.8789091000000004]
["8006","KOR",6.5361000000000002E-2,6.5361000000000002E-2]
["8006","NOK",0.39230700000000002,0.39230700000000002]
["8006","NZD",0.12809200000000001,0.12809200000000001]
["8006","SEK",1.63341143,1.63341143]
["8006","SGD",0.82974351000000002,0.82974351000000002]
["8006","USD",0.23396684000000001,0.23396684000000001]
["8007","CAD",3.5760000000000002E-3,0.69915569999999994]
["8007","CNY",0.69230999999999998,-3.2696999999999535E-3]
["611","AUD",215.08093331000001,215.08093331000001]
["611","CAD",236.06038928000001,236.06038928000001]
["611","EUR",359.09117300000003,359.09117300000003]
["611","GBP",314.213774,314.213774]
["611","HKD",129.862402,129.862402]
["611","JPY",347.48579541000004,347.48579541000004]
["611","KOR",47.850628999999998,47.850628999999998]
["611","NTD",53.058442999999997,53.058442999999997]
["611","SEK",60.192525000000003,60.192525000000003]
["611","USD",2611.7962670000002,2611.7962670000002]
["612","AUD",19.739245,19.739245]
["612","CAD",582.19123411999999,646.70931653999992]
["612","EUR",16.912714999999999,2.5313657100000011]
["612","GBP",16.537849000000001,8.459471970000001]
["612","JPY",14.659174999999999,7.6478292699999999]
["612","NZD",0.96293600000000001,5.1271999999997207E-4]
["612","SEK",8.8974600000000006,8.8974600000000006]
["612","USD",114.70011887999999,80.615531789999991]
["613","AUD",28.644158000000001,28.644158000000001]
["613","CAD",599.81279500000005,599.81279500000005]
["613","EUR",22.738842000000002,22.738842000000002]
["613","GBP",22.274225000000001,22.274225000000001]
["613","JPY",19.747152,19.747152]
["613","SEK",8.9894420000000004,8.9894420000000004]
["613","USD",161.314921,161.314921]
["618","CAD",315.80928885000003,364.10082048999999]
["618","NZD",4.2014860000000001,-2.7841200000001116E-3]
["618","USD",43.433782149999999,-0.65347936999999734]
["650","CAD",1760.45991751,2029.31969069]
["650","EUR",339.61336599999998,339.61336599999998]
["650","HKD",103.17084147,103.17084147]
["650","USD",931.61322601999996,662.75345283999991]
["653","AUD",1.4943E-2,1.4943E-2]
["653","CAD",265.73079087000002,265.73079087000002]
["653","EUR",2.6054970000000002,2.6054970000000002]
["653","GBP",4.3295070000000004,4.3295070000000004]
["653","USD",215.47269613,215.47269613]
["6562","CAD",11.578678999999999,12.186546439999999]
["6562","EUR",0,-0.58946557999999993]
["6562","GBP",0,-0.21657377000000003]
["6562","JPY",0,-0.2277662]
["6562","USD",0,0.42593810999999998]
["6570","CAD",178.67665299999999,198.78590316]
["6570","CHF",0,-0.47182880999999999]
["6570","EUR",0,-7.3038236400000001]
["6570","GBP",0,-1.1669213000000001]
["6570","JPY",0,-2.1448199199999998]
["6570","USD",12.891731999999999,3.86987551]
["6573","CAD",26.258334000000001,28.274000920000002]
["6573","CHF",0,-9.1460539999999993E-2]
["6573","EUR",0,-0.76165945999999995]
["6573","GBP",0,2.4289699999999984E-2]
["6573","JPY",0,-0.21409138000000003]
["6573","USD",1.3491850000000001,0.37643976000000001]
["6580","CAD",22.286718,22.3395817]
["6580","CHF",0,0.35857913000000002]
["6580","EUR",0,1.9098600000000152E-3]
["6580","GBP",0,3.6730249999999999E-2]
["6580","JPY",0,-0.58964843999999994]
["6580","USD",0,0.13956550000000001]
["6586","CAD",4.5456139999999996,4.5456139999999996]
["6592","CAD",96.818743999999995,106.62463649999999]
["6592","CHF",0,-0.61924168000000002]
["6592","EUR",0,-4.7423846699999999]
["6592","GBP",0,-2.1552829999999957E-2]
["6592","JPY",0,-1.1185658599999999]
["6592","USD",6.7314829999999999,3.4273355400000001]
["6602","CAD",5.9778190000000002,5.7245959900000001]
["6602","CHF",0,1.304658E-2]
["6602","EUR",0,-0.25298231999999998]
["6602","GBP",0,3.2329249999999997E-2]
["6602","USD",0,0.4608295]
["8003","CAD",6.3518034999999999,6.3518035000000017]
["8005","CAD",1.3283038900000002,1.3283038900000002]
["8006","CAD",0.10050401000000007,0.10050401000000007]
["724","CAD",2011.4623775,2502.9440820899999]
["724","EUR",228.364724,73.502478699999983]
["724","HKD",68.169951560000001,68.169951560000001]
["724","NZD",4.0985719999999999,-3.8159640000000133E-2]
["724","USD",813.54005493999989,481.05732728999999]
["734","AUD",2.4716320000000001,2.4716320000000001]
["734","CAD",13.086206000000001,23.658755849999995]
["734","CHF",5.4489570000000001,5.4489570000000001]
["734","EUR",19.020043999999999,17.954209049999999]
["734","GBP",1.19814,7.9030311299999996]
["734","HKD",1.2107559999999999,1.2107559999999999]
["734","JPY",6.7402030000000002,16.660629520000004]
["734","KOR",4.0451750000000004,4.0451750000000004]
["734","NOK",1.2391030000000001,1.2391030000000001]
["734","USD",103.286694,77.154661450000006]
["734","ZAR",1.176604,1.176604]
["736","CAD",69.43800152,138.21829982999998]
["736","CHF",102.504772,102.504772]
["736","EUR",141.767786,141.767786]
["736","GBP",100.56561600000001,100.56561600000001]
["736","HKD",119.061261,119.061261]
["736","JPY",183.66392648000001,183.66392648000001]
["736","KOR",46.729238000000002,46.729238000000002]
["736","USD",978.68084899999997,909.90055069000005]
["738","CAD",320.87829262999998,331.41702159999994]
["738","CHF",17.199081,17.199081]
["738","EUR",6.0263609999999996,6.0263609999999996]
["738","HKD",13.016223,13.016223]
["738","JPY",13.881083369999999,13.881083369999999]
["738","KOR",10.301976,10.301976]
["738","USD",150.06606500000001,139.52733603000001]
["740","CAD",442.31333121,555.22684886000002]
["740","CHF",12.609999,12.609999]
["740","EUR",3.1547109999999998,3.1540522200000001]
["740","GBP",0,4.4474100000001489E-3]
["740","HKD",9.8401820000000004,9.8401820000000004]
["740","JPY",10.227495210000001,2.3730545900000006]
["740","KOR",7.6310950000000002,7.6310950000000002]
["740","NZD",5.2735149999999997,1.7333120000000111E-2]
["740","USD",168.84056058000002,69.033876799999987]
["756","CAD",147.30105049000002,401.08066708000007]
["756","USD",301.98223150999996,48.202614920000016]
["C11","CAD",82.471224000000007,82.471224000000007]
["C12","CAD",443.63465100000002,443.63465100000002]
["C13","CAD",480.93922800000001,480.93922800000001]
["C14","CAD",530.58374200000003,530.58374200000003]
["C14","USD",-5.7840000000000001E-3,-5.7840000000000001E-3]
["C17","AUD",0.63529199999999997,0.63529199999999997]
["C17","CAD",2.7816390000000002,2.7816390000000002]
["C17","DKK",0.72189800000000004,0.72189800000000004]
["C17","EUR",3.0442089999999999,3.0442089999999999]
["C17","GBP",2.2303069999999998,2.2303069999999998]
["C17","HKD",0.94010499999999997,0.94010499999999997]
["C17","JPY",2.2282090000000001,2.2282090000000001]
["C17","KOR",0.884131,0.884131]
["C17","NOK",0.31913599999999998,0.31913599999999998]
["C17","NTD",0.80412499999999998,0.80412499999999998]
["C17","SEK",0.62770899999999996,0.62770899999999996]
["C17","SGD",0.122513,0.122513]
["C17","USD",15.675993,15.675993]
["C19","BRL",9.7476999999999994E-2,9.7476999999999994E-2]
["C19","CAD",1.0684084700000003,97.863639300000003]
["C19","EUR",46.610163999999997,46.610163999999997]
["C19","HKD",7.9148719999999999,7.9148719999999999]
["C19","USD",518.83101652999994,422.03578569999996]
["C24","CAD",8.1608902299999997,16.797962129999998]
["C24","CHF",12.975336,12.975336]
["C24","EUR",17.930229000000001,17.930229000000001]
["C24","GBP",12.872584,12.872584]
["C24","HKD",15.289508,15.289508]
["C24","JPY",23.177605220000004,23.177605220000004]
["C24","KOR",5.9242020000000002,5.9242020000000002]
["C24","USD",123.77815054999999,115.14107865000001]
["C30","AUD",4.5140462999999995,2.3222875099999989]
["C30","CAD",0.17053230999999999,11.25125349]
["C30","CHF",0.648003,0.28722331999999995]
["C30","EUR",5.1014650000000001,3.7287286399999995]
["C30","GBP",7.7529310000000002,5.2261731200000003]
["C30","HKD",4.0501449999999997,2.7977491299999997]
["C30","JPY",5.7338833899999999,3.1449586099999998]
["C30","KOR",0.67475099999999999,0.55547234999999995]
["C30","NTD",0.70227399999999995,0.37379666000000006]
["C30","SEK",0.68725700000000001,0.34764517000000006]
["C35","AED",3.1322909999999999,3.1322909999999999]
["C35","BRL",19.6877225,19.6877225]
["C35","CAD",1.6077085999999996,1.6077085999999996]
["C35","CLP",0.203517,0.203517]
["C35","CNY",9.7668213900000005,9.7668213900000005]
["C35","COP",-4.4651999999999997E-2,-4.4651999999999997E-2]
["C35","HKD",67.991810689999994,67.991810689999994]
["C35","IDR",0.84015700000000004,0.84015700000000004]
["C35","INR",18.442731239999997,18.442731239999997]
["C35","KOR",41.172673700000004,41.172673700000004]
["C35","MXN",7.0881784100000003,7.0881784100000003]
["C35","MYR",3.8907219999999998,3.8907219999999998]
["C35","NGN",0.90268899999999996,0.90268899999999996]
["C35","NTD",45.062775129999999,45.062775129999999]
["C35","PHP",5.3706680000000002,5.3706680000000002]
["C35","RUB",11.621718660000001,11.621718660000001]
["C35","THB",9.1801877300000001,9.1801877300000001]
["C35","TRL",2.5691109999999999,2.5691109999999999]
["C35","USD",28.8742199,28.8742199]
["C35","ZAR",11.890166050000001,11.890166050000001]
["C36","CAD",223.14656199999999,223.60223259000003]
["C36","CHF",0,1.6981787400000001]
["C36","EUR",-0.62198900000000001,7.7061822399999951]
["C36","GBP",-4.7981000000000003E-2,7.9051023300000001]
["C36","JPY",7.0080000000000003E-3,3.8729301900000053]
["C36","USD",16.230642,-6.0703840900000037]
["C42","AUD",36.942247000000002,36.942247000000002]
["C42","CAD",174.18444500000001,174.18444500000001]
["C42","EUR",2.1713209999999998,2.1713209999999998]
["C42","GBP",6.3405300000000002,6.3405300000000002]
["C42","USD",66.69256,66.69256]
["C42","ZAR",0.60901400000000006,0.60901400000000006]
["C44","CAD",13.48439449,13.48439449]
["C44","EUR",0.27200200000000002,0.27200200000000002]
["C44","GBP",0.24001600000000001,0.24001600000000001]
["C44","USD",12.17215051,12.17215051]
["C50","CAD",26.207042999999999,26.207042999999999]
["C513","CAD",137.60397800000001,137.60397800000001]
["C515","CAD",334.507498,334.507498]
["C516","CAD",7.1089599999999997,7.1089599999999997]
["C517","CAD",99.837941999999998,99.837941999999998]
["C51","CAD",197.86180400000001,197.86180400000001]
["C51","USD",5.6639999999999998E-3,5.6639999999999998E-3]
["C55","CAD",47.749180420000002,159.35527414000001]
["C55","CHF",16.881253999999998,16.881253999999998]
["C55","EUR",145.40318300000001,145.40318300000001]
["C55","GBP",28.537213000000001,28.537213000000001]
["C55","HKD",30.765681000000001,30.765681000000001]
["C55","SEK",11.868698,11.868698]
["C55","USD",383.06106657999999,271.45497285999994]
["C57","CAD",22.740079000000001,22.740079000000001]
["C58","CAD",101.155272,101.155272]
["C58","EUR",2.7369999999999998E-3,2.7369999999999998E-3]
["C58","USD",1.5834999999999998E-2,1.5834999999999998E-2]
["C62","CAD",662.50954899999999,662.50954899999999]
["C62","USD",1.1E-5,1.1E-5]
["C655","CAD",5.2102180000000002,5.2102180000000002]
["C656","CAD",111.54646099999999,111.54646099999999]
["C657","CAD",9.1533350000000002,9.1533350000000002]
["C659","CAD",3.0944500000000001,3.0944500000000001]
["C65","CAD",6.4801945400000003,46.403639030000001]
["C65","CHF",5.5159039999999999,2.3212975]
["C65","EUR",57.054591000000002,44.022445600000005]
["C65","GBP",57.804309459999999,36.823147620000007]
["C65","HKD",1.5999999999999999E-5,1.5999999999999999E-5]
["C65","SEK",5.6249820000000001,2.9094512499999996]
["C65","USD",-6.9999999999999999E-6,-6.9999999999999999E-6]
["C75","CAD",4.6369123100000005,362.68629992999996]
["C75","EUR",5.7520090000000001,-9.5516600000001492E-3]
["C75","GBP",-2.12E-4,-2.12E-4]
["C75","USD",358.16165969000002,5.8738327300000188]
["C76","CAD",6.0828061799999995,6.0828061799999995]
["C76","EUR",55.402534000000003,55.402534000000003]
["C76","USD",3740.8895038200003,3740.8895038200003]
["C84","AUD",20.681249059999999,0.3554987599999942]
["C84","CAD",31.295485830000001,409.32645221999996]
["C84","EUR",34.442816999999998,-2.9340708900000005]
["C84","GBP",30.084965,0.21772046000000089]
["C84","HKD",12.487387999999999,-0.12841557000000028]
["C84","JPY",32.398701109999998,4.9871766800000001]
["C84","KOR",4.5928440000000004,4.5928440000000004]
["C84","NTD",5.1240269999999999,5.1240269999999999]
["C84","SEK",5.7867160000000002,6.4461199999999261E-2]
["C84","USD",245.20247599999999,0.49097513999998571]
["C85","AUD",35.908577090000001,35.908577090000001]
["C85","CAD",31.830956699999998,31.830956699999998]
["C85","EUR",60.589140999999998,60.589140999999998]
["C85","GBP",53.700055999999996,53.700055999999996]
["C85","HKD",21.679801000000001,21.679801000000001]
["C85","JPY",62.690134210000004,62.690134210000004]
["C85","KOR",7.9892799999999999,7.9892799999999999]
["C85","SEK",10.04983,10.04983]
["C85","NTD",8.8589660000000006,8.8589660000000006]
["C85","USD",435.38144199999999,435.38144199999999]
["C88","CAD",1.2389193500000002,1.2389193500000002]
["C88","USD",26.655538649999997,26.655538649999997]
["C96","CAD",86.274075890000006,89.045369730000004]
["C96","CHF",4.559018,4.559018]
["C96","EUR",1.594147,1.594147]
["C96","HKD",3.4361739999999998,3.4361739999999998]
["C96","JPY",3.69617511,3.69617511]
["C96","KOR",2.7215720000000001,2.7215720000000001]
["C96","USD",39.528008999999997,36.756715159999999]
["C98","CAD",197.06460899999999,197.06460899999999]
["C98","EUR",3.9100000000000002E-4,3.9100000000000002E-4]
["C98","USD",6.9999999999999994E-5,6.9999999999999994E-5]
["C99","CAD",1.4829680000000001,1.4829680000000001]
["C99","USD",107.502819,107.502819]
["E01","AUD",1.3726689999999999,0.53352062000000011]
["E01","BRL",1.6223339999999999,1.82547269]
["E01","CAD",49.712939990000002,153.4975891]
["E01","CHF",0,-9.346241000000001E-2]
["E01","CLP",0.23216100000000001,0.23216100000000001]
["E01","COP",0,0.29951850000000002]
["E01","EUR",5.5787659999999999,1.6074541200000001]
["E01","GBP",0.18528500000000001,0.95945635000000007]
["E01","IDR",0,0.62363281000000004]
["E01","INR",0,0.19190368000000002]
["E01","JPY",13.832793000000001,2.0515087300000006]
["E01","KOR",0,0.84330044999999998]
["E01","MXN",5.3850980000000002,-0.13820745000000018]
["E01","NOK",1.298362,-0.11492442000000015]
["E01","NTD",0,1.8024939800000002]
["E01","NZD",2.0279389999999999,-0.6505108799999999]
["E01","PEN",0,1.0065409999999999]
["E01","PHP",0,0.61111810999999994]
["E01","RUB",3.1157439999999998,3.1157439999999998]
["E01","SEK",3.4426960000000002,3.3663169900000001]
["E01","THB",0,1.1864283899999999]
["E01","USD",85.210320010000004,0.37711044000001254]
["E01","ZAR",1.1604779999999999,1.0434192]
["E02","AUD",0.49451000000000001,-5.5536400000000142E-3]
["E02","BRL",1.0545169999999999,1.0545169999999999]
["E02","CAD",257.26303631000002,533.42691345000003]
["E02","EUR",0.77951199999999998,1.007673999999999E-2]
["E02","MXN",2.1077789999999998,4.8945459999999961E-2]
["E02","RUB",2.5768,2.5768]
["E02","USD",293.49192569000002,20.656380990000009]
["E02","ZAR",0.66817800000000005,0.66817800000000005]
["E03","CAD",14.007008979999998,552.51790416999995]
["E03","EUR",3.4220320000000002,8.7168100000000096E-2]
["E03","USD",554.72916801999997,19.553136729999899]
["E04","CAD",159.22249895000002,185.38472654000003]
["E04","EUR",1.4878000000000001E-2,1.1567000000000008E-4]
["E04","NZD",2.1614000000000001E-2,2.1614000000000001E-2]
["E04","USD",30.488297049999996,4.3408317899999957]
["E05","CAD",345.10364900000002,345.10364900000002]
["E05","USD",3.0119999999999999E-3,3.0119999999999999E-3]
["E06","CAD",0.17279700000000001,0.17279700000000001]
["E06","USD",107.127683,107.127683]
["E07","CAD",2.4632999999999999E-2,2.4632999999999999E-2]
["E07","CHF",1.765855,1.765855]
["E07","DKK",1.7714479999999999,1.7714479999999999]
["E07","EUR",9.458107,9.458107]
["E07","GBP",5.1899240000000004,5.1899240000000004]
["E07","NOK",0.39702700000000002,0.39702700000000002]
["E07","SEK",0.81132300000000002,0.81132300000000002]
["E07","USD",0.64730600000000005,0.64730600000000005]
["E08","AUD",8.9073910000000005,8.9073910000000005]
["E08","CAD",19.382916999999999,19.382916999999999]
["E08","CHF",6.8915369999999996,6.8915369999999996]
["E08","DKK",8.000826,8.000826]
["E08","EUR",34.032139000000001,34.032139000000001]
["E08","GBP",25.799627999999998,25.799627999999998]
["E08","HKD",7.6313170000000001,7.6313170000000001]
["E08","ILS",0.80278700000000003,0.80278700000000003]
["E08","JPY",35.349066999999998,35.349066999999998]
["E08","NOK",1.995115,1.995115]
["E08","NZD",1.2734719999999999,1.2734719999999999]
["E08","SEK",2.8444669999999999,2.8444669999999999]
["E08","SGD",0.60194300000000001,0.60194300000000001]
["E08","USD",155.064851,155.064851]
["E09","BRL",6.7408869999999999,6.7408869999999999]
["E09","CAD",5.8129E-2,5.8129E-2]
["E09","COP",0.13453000000000001,0.13453000000000001]
["E09","EUR",1.2187760000000001,1.2187760000000001]
["E09","GBP",0.26304,0.26304]
["E09","HKD",8.8197759999999992,8.8197759999999992]
["E09","HUF",0.39202100000000001,0.39202100000000001]
["E09","IDR",1.139473,1.139473]
["E09","INR",14.354091,14.354091]
["E09","KOR",6.4253299999999998,6.4253299999999998]
["E09","MXN",2.4584440000000001,2.4584440000000001]
["E09","MYR",2.1566939999999999,2.1566939999999999]
["E09","NTD",8.1492900000000006,8.1492900000000006]
["E09","PHP",1.603192,1.603192]
["E09","PLN",0.39518500000000001,0.39518500000000001]
["E09","THB",5.1719910000000002,5.1719910000000002]
["E09","TRL",1.061687,1.061687]
["E09","USD",2.2893110000000001,2.2893110000000001]
["E09","ZAR",2.0877840000000001,2.0877840000000001]
["E10","AUD",6.4396810000000002,6.4396810000000002]
["E10","CAD",0.26241100000000001,0.26241100000000001]
["E10","CHF",3.9313120000000001,3.9313120000000001]
["E10","DKK",3.0464880000000001,3.0464880000000001]
["E10","EUR",16.579117,16.579117]
["E10","GBP",10.493176,10.493176]
["E10","HKD",6.059971,6.059971]
["E10","ILS",0.46665299999999998,0.46665299999999998]
["E10","JPY",18.911011999999999,18.911011999999999]
["E10","NOK",0.34381499999999998,0.34381499999999998]
["E10","NZD",1.1349469999999999,1.1349469999999999]
["E10","SEK",1.960583,1.960583]
["E10","SGD",0.57674599999999998,0.57674599999999998]
["E10","USD",2.1542129999999999,2.1542129999999999]
["E11","BRL",0.16223299999999999,0.16223299999999999]
["E11","CAD",51.392012980000004,173.45243234999995]
["E11","EUR",3.7060140000000001,-2.4491669999999924E-2]
["E11","GBP",3.552473,0.10237137999999989]
["E11","MXN",1.7528410000000001,3.4656260000000008E-2]
["E11","RUB",2.4262359999999998,2.4262359999999998]
["E11","USD",134.83721902000002,21.675591680000021]
["E11","ZAR",0.11163099999999999,0.11163099999999999]
["E12","AUD",0.35412700000000003,0.35412700000000003]
["E12","CAD",0.559863,0.559863]
["E12","CHF",4.9399999999999999E-2,4.9399999999999999E-2]
["E12","DKK",2.6016999999999998E-2,2.6016999999999998E-2]
["E12","EUR",1.581053,1.581053]
["E12","GBP",0.35855399999999998,0.35855399999999998]
["E12","HKD",4.4785999999999999E-2,4.4785999999999999E-2]
["E12","ILS",9.0039999999999999E-3,9.0039999999999999E-3]
["E12","NOK",5.8985000000000003E-2,5.8985000000000003E-2]
["E12","NZD",9.2540000000000001E-3,9.2540000000000001E-3]
["E12","SEK",0.343526,0.343526]
["E12","SGD",1.3967E-2,1.3967E-2]
["E12","USD",6.0823980000000004,6.0823980000000004]
["E13","CAD",0.49212400000000001,2.17480998]
["E13","USD",3.352751,1.6700650199999996]
["E14","AUD",0.95517600000000003,0.95517600000000003]
["E14","CAD",1.155702,1.155702]
["E14","EUR",0.94796000000000002,0.94796000000000002]
["E14","GBP",0.61951000000000001,0.61951000000000001]
["E14","HKD",0.44864900000000002,0.44864900000000002]
["E14","JPY",1.3953709999999999,1.3953709999999999]
["E14","KOR",0.23247699999999999,0.23247699999999999]
["E14","NTD",0.28197,0.28197]
["E14","SEK",0.44280399999999998,0.44280399999999998]
["E14","USD",8.6058660000000007,8.6058660000000007]
["E15","CAD",16.45217237,17.824043750000001]
["E15","USD",1.6646756299999999,0.29280424999999999]
["E16","CAD",0.87710200000000005,0.87710200000000005]
["E16","HKD",5.1601990000000004,5.1601990000000004]
["E17","CAD",73.121949999999998,73.121949999999998]
["E17","USD",1.7377E-2,1.7377E-2]
["E18","CAD",33.881183999999998,33.881183999999998]
["E18","USD",1.1384999999999999E-2,1.1384999999999999E-2]
["E19","CAD",0.149594,0.149594]
["E19","USD",200.188073,200.188073]
["E20","CAD",4.2112280000000002,8.3252729100000007]
["E20","USD",0,-4.1140449100000005]
["E21","AUD",1.8068610000000001,1.8068610000000001]
["E21","CAD",4.3869999999999999E-2,4.3869999999999999E-2]
["E21","CHF",2.1901570000000001,2.1901570000000001]
["E21","DKK",0.43296699999999999,0.43296699999999999]
["E21","EUR",7.7709820000000001,7.7709820000000001]
["E21","GBP",4.1720050000000004,4.1720050000000004]
["E21","HKD",0.89637800000000001,0.89637800000000001]
["E21","ILS",0.128278,0.128278]
["E21","JPY",6.6599469999999998,6.6599469999999998]
["E21","NOK",0.21013899999999999,0.21013899999999999]
["E21","NZD",8.1088999999999994E-2,8.1088999999999994E-2]
["E21","SEK",0.73675500000000005,0.73675500000000005]
["E21","SGD",0.35486099999999998,0.35486099999999998]
["E21","USD",0.37424200000000002,0.37424200000000002]
["E22","AUD",0,-0.13536962999999999]
["E22","CAD",1.9648429999999999,3.8980666500000005]
["E22","CHF",0,-0.16459914]
["E22","DKK",0,-3.2704980000000002E-2]
["E22","EUR",0,-0.58279003000000007]
["E22","GBP",0,-0.31418618999999992]
["E22","HKD",0,-6.6034110000000007E-2]
["E22","ILS",0,-9.7306499999999987E-3]
["E22","JPY",0,-0.49687735]
["E22","NOK",0,-1.5754709999999998E-2]
["E22","NZD",0,-5.91341E-3]
["E22","SEK",0,-5.5465690000000005E-2]
["E22","SGD",0,-2.6142529999999994E-2]
["E22","USD",0,-2.7655229999999999E-2]
["E23","CAD",83.555322000000004,83.555322000000004]
["E24","CAD",4.053553,4.053553]
["E25","CAD",12.378213000000001,12.378213000000001]
["E26","CAD",1.1893522999999999,423.13730913000012]
["E26","USD",421.75377370000001,-0.19418313000011445]
["E27","CAD",3.4882330600000007,298.9041111300001]
["E27","USD",293.43652193999998,-1.9793561300001143]
["E28","CAD",0.78325005999999964,34.896936790000005]
["E28","USD",33.516698939999998,-0.59698779000000657]
["E29","BRL",6.9069380000000002,6.9425546599999999]
["E29","CAD",1.0865538400000001,1.0865538399999992]
["E29","CLP",1.5095817900000001,1.5095817900000001]
["E29","COP",2.9335369999999998,2.9335369999999998]
["E29","CZK",2.3897309999999998,2.3897309999999998]
["E29","HUF",2.127691,2.1695007500000001]
["E29","IDR",6.9227359999999996,6.9544798800000001]
["E29","MXN",6.9498150000000001,6.9498150000000001]
["E29","MYR",6.9148639999999997,6.9148639999999997]
["E29","PEN",-3.2187E-2,-0.17275392000000001]
["E29","PHP",3.7442671199999999,3.7442671199999999]
["E29","PLN",5.5327789999999997,5.5327789999999997]
["E29","RON",-3.2381E-2,-3.2381E-2]
["E29","RUB",4.8418020000000004,4.8418020000000004]
["E29","THB",6.9875030000000002,6.9875030000000002]
["E29","TRL",2.1909436900000001,2.1909436900000001]
["E29","ZAR",5.1913115599999999,5.2461204799999992]
["E29","USD",4.3713769999999998,4.3479647100000003]
["E30","CAD",4.2522005600000004,245.83667806000003]
["E30","USD",236.57341944000001,-5.0110580600000025]
["Q123","CAD",234.96860899999999,234.96860899999999]
["Q123","USD",2.6539E-2,2.6539E-2]
["Q124","CAD",3.2827190000000002,3.2827190000000002]
["Q124","USD",0.34610999999999997,0.34610999999999997]
["Q144","CAD",4.0551504899999999,4.0551504899999999]
["Q144","USD",0.42157051000000001,0.42157051000000001]
["Q145","CAD",3.873507,3.873507]
["Q145","USD",3.7559999999999998E-3,3.7559999999999998E-3]
["Q30","CAD",97.042861000000002,97.042861000000002]
["Q30","EUR",10.231096000000001,10.231096000000001]
["Q30","USD",39.060329000000003,39.060329000000003]
["Q31","AUD",-9.9999999999999995E-7,-9.9999999999999995E-7]
["Q31","BRL",7.9999999999999996E-6,7.9999999999999996E-6]
["Q31","CAD",6.1317849999999998,6.1317849999999998]
["Q31","CHF",2.773361,2.773361]
["Q31","EUR",23.298928,23.298928]
["Q31","GBP",21.474336000000001,21.474336000000001]
["Q31","ILS",2.1606640000000001,2.1606640000000001]
["Q31","JPY",2.4357139999999999,2.4357139999999999]
["Q31","KOR",2.662658,2.662658]
["Q31","NOK",3.0000000000000001E-6,3.0000000000000001E-6]
["Q31","SEK",2.8564590000000001,2.8564590000000001]
["Q31","TRL",0.65549299999999999,0.65549299999999999]
["Q31","USD",78.988304999999997,78.988304999999997]
["Q46","AUD",1.6611100000000001,1.6611100000000001]
["Q46","CAD",219.80918336000002,219.80918336000002]
["Q46","CHF",3.0932520000000001,3.0932520000000001]
["Q46","EUR",11.185091999999999,11.185091999999999]
["Q46","GBP",13.322282,13.322282]
["Q46","HKD",1.121847,1.121847]
["Q46","ILS",1.274262,1.274262]
["Q46","JPY",3.8250679999999999,3.8250679999999999]
["Q46","KOR",0.90654800000000002,0.90654800000000002]
["Q46","SEK",0.96089999999999998,0.96089999999999998]
["Q46","SGD",1.3331630000000001,1.3331630000000001]
["Q46","THB",0.79141600000000001,0.79141600000000001]
["Q46","USD",33.484946640000004,33.484946640000004]
["Q47","CAD",109.43810000000001,109.43810000000001]
["Q47","USD",-6.7746000000000001E-2,-6.7746000000000001E-2]
["Q48","CAD",0.13121559999999963,0.13121559999999963]
["Q48","USD",170.4548264,170.4548264]
["Q49","AUD",1.0154190000000001,1.0154190000000001]
["Q49","CAD",0.61361873999999994,0.61361873999999994]
["Q49","CHF",4.7508290000000004,4.7508290000000004]
["Q49","EUR",14.747367000000001,14.747367000000001]
["Q49","GBP",9.5204649999999997,9.5204649999999997]
["Q49","HKD",2.0903360000000002,2.0903360000000002]
["Q49","JPY",8.8452582599999996,8.8452582599999996]
["Q49","KOR",0.872807,0.872807]
["Q49","NZD",2.5599999999999999E-4,2.5599999999999999E-4]
["Q49","SEK",0.87271900000000002,0.87271900000000002]
["Q49","SGD",-3.3515000000000003E-2,-3.3515000000000003E-2]
["Q49","USD",1.702874,1.702874]
["Q82","CAD",6.2376870000000002,6.2376870000000002]
["Q85","CAD",54.924122500000003,54.924122500000003]
["Q85","USD",0.38352449999999999,0.38352449999999999]
["Q88","CAD",228.82160200000001,228.82160200000001]
["Q89","CAD",0.48236789999999996,0.27224848000000001]
["Q89","EUR",0.43885000000000002,4.0448580000000019E-2]
["Q89","GBP",0.493647,-0.63226349999999998]
["Q89","USD",48.014301099999997,49.748732439999998]
["Q94","AUD",8.0465979999999995,8.0465979999999995]
["Q94","CAD",3.32830045,3.32830045]
["Q94","CHF",9.5377829999999992,9.5377829999999992]
["Q94","EUR",60.124966829999998,60.124966829999998]
["Q94","GBP",38.019007289999998,38.019007289999998]
["Q94","HKD",3.6441370000000002,3.6441370000000002]
["Q94","KOR",9.3436620000000001,9.3436620000000001]
["Q94","NOK",3.9909479999999999,3.9909479999999999]
["Q94","SEK",15.379523000000001,15.379523000000001]
["Q94","SGD",6.0000000000000002E-6,6.0000000000000002E-6]
["Q94","USD",48.461459429999998,48.461459429999998]

{"sheet":"FOFs","index":2,"n_rows":567,"n_cols":3,"rows_kept":567,"cut":false,"hidden":true,"merged":[]}
["MPower fund code","MPower fund code of underlying fund","investment in underlying fund\n(millions)"]
["086","4762",1.10312648]
["086","E03",1.4147592600000001]
["086","E11",10.09064]
["086","E27",5.3525596500000008]
["086","E28",2.43065416]
["086","E29",6.4011810000000002]
["086","E30",2.0241560000000001]
["1216","1238",8.9652019200000002]
["1216","307",3.55980835]
["1216","3091",55.530549690000001]
["1216","3092",34.061642020000001]
["1216","5025",10.731937109999999]
["1216","5026",14.476513619999999]
["1216","Q123",51.446046950000003]
["1219","1234",3.7089018199999999]
["1219","3069",31.16032173]
["1219","3091",7.4355795000000002]
["1219","3092",26.04252322]
["1219","4762",9.2654918100000003]
["1219","5027",8.3825173799999995]
["1219","5253",7.0393890099999998]
["1232","2979",57.8639674]
["1237","1238",11.476256230000001]
["1237","307",2.5229821299999999]
["1237","3091",13.90547875]
["1237","3092",10.10384631]
["1237","5025",16.594070179999999]
["1237","5026",28.395301100000001]
["1237","5027",26.627811870000002]
["1237","Q123",17.64174564]
["1259","1292",2.48860904]
["1259","307",0.49449740999999997]
["1259","3085",1.9873671899999998]
["1259","3086",1.2445868]
["1259","3092",9.9570929199999991]
["1259","4853",2.2581487]
["1259","5025",2.7504965499999998]
["1260","4324",0.38301471999999998]
["1260","5093",0.40532537000000002]
["1261","E29",0.20193]
["1261","E30",5.8956000000000001E-2]
["1870","2979",11.186179109999999]
["1870","307",8.3892232899999986]
["1870","3864",136.50258737999999]
["1870","3914",2.87873139]
["1870","3997",0.22387736999999999]
["1870","4773",5.9999999999999995E-8]
["1870","4775",0.22817899]
["1870","4798",35.053783039999999]
["1870","5213",25.529872319999999]
["1870","5546",2.17301835]
["1870","5976",2.2019110199999998]
["1870","5985",1.9577205099999999]
["1870","C35",3.9399999999999995E-6]
["1870","E25",1.5442499999999999]
["1870","E27",0.61613700000000005]
["1870","E30",2.5744120000000001]
["2167","5515",4.1503462000000004]
["2238","4710",12.207938789999998]
["2238","4762",1.42551546]
["2238","5093",6.07620439]
["2238","5218",5.8006297]
["2238","5960",0.74010240000000005]
["2238","618",50.71870285]
["2238","E03",12.329980000000001]
["2238","E11",143.84000831999998]
["2238","E27",19.87031382]
["2309","4762",1.65417473]
["2309","5218",7.1213087999999996]
["2309","E03",2.7165508799999998]
["2309","E11",15.508027999999999]
["2309","E27",8.0042462099999998]
["2309","E28",4.66707318]
["2309","E29",9.0464640000000003]
["2309","E30",3.2327539999999999]
["2421","5218",18.244743460000002]
["2891","2421",29.065018909999999]
["2891","2979",15.266854210000002]
["2891","307",22.529250620000003]
["2891","3864",80.793660239999994]
["2891","3914",147.47303849000002]
["2891","3997",44.76676535]
["2891","3999",13.98343425]
["2891","4773",140.83441119999998]
["2891","4775",43.662303489999999]
["2891","4798",0.23075100000000001]
["2891","5014",146.57675372]
["2891","5213",4.5765858699999997]
["2891","5515",17.173324640000001]
["2891","5517",18.647288410000002]
["2891","5546",16.803852089999999]
["2891","5976",11.68397122]
["2891","5985",4.9694056099999999]
["2891","5986",3.9581620200000001]
["2891","E27",13.932006300000001]
["2891","E30",5.0210860000000004]
["2898","2421",59.273391070000002]
["2898","2979",103.35686181]
["2898","307",64.188505489999997]
["2898","3864",325.09687320999996]
["2898","3914",343.22287710000001]
["2898","3997",243.14104728000001]
["2898","3999",29.00240294]
["2898","4324",8.8300000000000002E-6]
["2898","4773",276.05841627000001]
["2898","4775",56.723227080000001]
["2898","4798",24.159418649999999]
["2898","5014",353.34216066000005]
["2898","5213",18.32800155]
["2898","5515",21.070021620000002]
["2898","5517",31.437827309999999]
["2898","5546",47.473427860000001]
["2898","5976",33.006365079999995]
["2898","5985",15.783199460000001]
["2898","5986",8.5203060500000003]
["2898","E27",82.052739599999995]
["2898","E30",14.680044000000001]
["2905","2421",30.203775359999998]
["2905","2979",112.69259654000001]
["2905","307",121.5898636]
["2905","3864",532.69663627]
["2905","3914",480.00937263999998]
["2905","3997",248.91091205000001]
["2905","3999",6.3927850900000003]
["2905","4773",128.43180296]
["2905","4775",21.495192289999999]
["2905","4798",51.367465100000004]
["2905","5014",213.68714244999998]
["2905","5213",24.701690929999998]
["2905","5515",10.726231650000001]
["2905","5517",26.121882790000001]
["2905","5546",43.98232969]
["2905","5976",32.827855390000003]
["2905","5985",14.156365660000001]
["2905","5986",6.5712772800000003]
["2905","E27",2.2734410999999999]
["2905","E30",44.079436000000001]
["291","4710",7.5350435599999992]
["291","4762",6.4415994800000007]
["291","5093",49.40706531]
["291","5218",2.3176623100000002]
["291","E27",15.010663769999999]
["2912","2421",22.87984569]
["2912","2979",101.17652056]
["2912","302",8.3100000000000001E-6]
["2912","307",136.33091437000002]
["2912","3864",498.28610643000002]
["2912","3914",222.64815261000001]
["2912","3997",259.24768325000002]
["2912","3999",11.569659130000002]
["2912","4773",34.975564549999994]
["2912","4775",31.873408140000002]
["2912","4798",49.725834420000005]
["2912","5014",187.94118824]
["2912","5213",13.07139263]
["2912","5515",6.6875452599999994]
["2912","5517",6.6878949299999997]
["2912","5546",27.102489859999999]
["2912","5976",19.788723860000001]
["2912","5985",12.08127135]
["2912","5986",3.3604029999999998]
["2912","E27",16.433104800000002]
["2912","E30",11.859982]
["292","5519",1.4692786899999999]
["2946","E19",29.540098960000002]
["2947","5519",1.8365983700000001]
["296","5519",6.4280942799999998]
["296","5968",17.219124999999998]
["302","E27",19.935478140000001]
["3072","5218",3.0919428]
["3077","1234",8.16935374]
["3077","1238",6.8690278099999995]
["3077","1292",9.5274197699999998]
["3077","1360",8.270184089999999]
["3077","302",58.882480869999995]
["3077","3069",73.99243774]
["3077","3085",9.5531143599999986]
["3077","3091",16.416646719999999]
["3077","4762",16.304172470000001]
["3077","4853",9.5104739600000006]
["3077","5026",8.210654400000001]
["3077","5027",20.631761179999998]
["3077","5253",11.04852167]
["3077","611",8.2185654299999999]
["3077","Q88",8.1139034300000006]
["3078","1234",6.0311780499999994]
["3078","1238",7.2853602999999998]
["3078","1292",13.27572988]
["3078","1360",12.331955689999999]
["3078","302",46.069458850000004]
["3078","3069",49.729036350000001]
["3078","3085",10.876540140000001]
["3078","3087",7.24988206]
["3078","3091",10.903661980000001]
["3078","4762",9.6299718199999997]
["3078","4853",12.218429779999999]
["3078","5026",11.08439641]
["3078","5027",15.79380115]
["3078","5253",7.32527157]
["3078","611",15.743142300000001]
["3078","Q88",7.2246363099999993]
["3079","1292",39.909561140000001]
["3079","1360",47.004339999999999]
["3079","1537",26.002155559999999]
["3079","2946",17.179936619999999]
["3079","302",77.037376590000008]
["3079","3069",96.99957065000001]
["3079","3085",28.530925159999999]
["3079","3087",17.172623269999999]
["3079","3091",14.27613901]
["3079","4762",17.063847460000002]
["3079","4853",40.54703224]
["3079","5026",38.157581819999997]
["3079","5027",22.86047524]
["3079","611",28.696431660000002]
["3079","C55",28.724002239999997]
["3079","Q88",34.009724890000001]
["3080","1292",14.745266409999999]
["3080","1360",29.99764077]
["3080","1537",22.301105850000003]
["3080","2946",16.630331300000002]
["3080","296",14.79450462]
["3080","302",32.974827359999999]
["3080","3069",29.295729850000001]
["3080","3085",27.662473540000001]
["3080","3087",20.334018749999998]
["3080","3998",14.666777529999999]
["3080","4853",31.6907447]
["3080","5026",22.491828170000002]
["3080","5027",11.055414619999999]
["3080","611",18.43748755]
["3080","653",14.596951109999999]
["3080","C55",24.17524027]
["3080","Q88",23.88196555]
["3081","1292",15.56160551]
["3081","1360",29.279586930000001]
["3081","1537",19.588477510000001]
["3081","2946",16.927681660000001]
["3081","296",14.425877699999999]
["3081","3085",31.286931059999997]
["3081","3086",0]
["3081","3087",23.436752170000002]
["3081","3998",12.959622029999998]
["3081","4853",25.083888590000001]
["3081","5026",15.94612482]
["3081","611",16.915389219999998]
["3081","653",16.836993549999999]
["3081","C55",23.430354659999999]
["3864","4710",6.0942341900000008]
["3864","E27",16.787749079999998]
["4345","5093",11.297813080000001]
["4345","5960",1.2129456000000001]
["4345","E27",4.6178945999999996]
["4444","2421",15.740977409999999]
["4444","2979",96.738054819999988]
["4444","307",57.515245350000001]
["4444","3864",407.24086604000001]
["4444","3914",160.41609108]
["4444","3997",281.60213693999998]
["4444","3999",9.1343922400000004]
["4444","4773",28.999751929999999]
["4444","4775",25.126121999999999]
["4444","4798",32.767152969999998]
["4444","5014",100.26419184999999]
["4444","5213",36.191216880000006]
["4444","5515",3.9531815400000001]
["4444","5517",5.2780014500000005]
["4444","5546",16.193973809999999]
["4444","5976",12.45319245]
["4444","5985",9.9580376999999984]
["4444","5986",1.32818254]
["4444","E27",3.3208739999999999]
["4444","E30",16.881067999999999]
["4710","4762",1.6747746499999998]
["4710","E03",0.95528084000000002]
["4710","E11",5.4388160000000001]
["4710","E27",2.7873411299999997]
["4710","E28",1.6412345400000001]
["4710","E29",3.2005905000000001]
["4710","E30",1.2085980000000001]
["4762","5960",37.806897599999999]
["4762","E27",23.033498519999998]
["4762","E29",22.666642499999998]
["4762","E30",37.299495999999998]
["4777","302",102.06261781000001]
["4777","4762",138.47533866999999]
["4777","4787",417.95404912999999]
["4777","4798",59.704159049999994]
["4777","5213",8.2034049400000004]
["4777","C99",15.020139840000001]
["4787","E19",65.768919999999994]
["4788","302",104.56138602]
["4788","4762",141.79062094999998]
["4788","4787",163.57712434999999]
["4788","4798",60.985815240000001]
["4788","5213",8.8431968800000007]
["4788","C99",9.8974671000000001]
["4804","E03",0.32505943999999998]
["4804","E11",0.93503999999999998]
["4804","E27",0.89089233000000001]
["4804","E28",0.55831885999999997]
["4804","E29",1.0096499999999999]
["4804","E30",0.363562]
["4825","4762",6.179979E-2]
["4825","5218",0.24600885]
["4825","E03",0.12757795]
["4825","E27",0.38534669999999999]
["4825","E28",0.21919326]
["4825","E29",0.46443899]
["4825","E30",0.14738999999999999]
["4841","4762",5.1499839999999998E-2]
["4841","E03",5.9510819999999999E-2]
["4841","E27",0.15184122]
["4841","E28",6.2300040000000001E-2]
["4841","E29",0.20193]
["4841","E30",5.8956000000000001E-2]
["4855","4762",14.27599109]
["4855","8007",0.69489699999999999]
["4855","C99",12.70402374]
["4855","E03",30.27]
["4855","E09",3.3641999999999999]
["4855","E26",8.0128000000000004]
["4855","E30",52.71649]
["5044","E06",49.431074020000004]
["5056","E08",28.160907980000001]
["5068","E07",2.92841811]
["5080","E10",23.759536050000001]
["5092","E09",3.2470777799999997]
["5213","E26",31.063221760000001]
["5401","E04",8.2751414000000008]
["5401","E07",1.55496985]
["5401","E09",0.88838909999999993]
["5401","E10",0.54853050000000003]
["5401","E11",2.7135639999999999]
["5401","E12",1.1118625]
["5401","E14",0.17191200000000001]
["5401","E15",0.18897375]
["5401","E18",5.2942048000000002]
["5401","E19",7.1371881999999998]
["5401","E21",0.59445225000000002]
["5401","E23",0.90187815000000005]
["5401","E25",1.1530400000000001]
["5401","E26",0.21834879999999998]
["5401","E27",2.7298002000000001]
["5401","E28",1.8785272]
["5401","E30",1.7392019999999999]
["5421","E04",5.1669544000000007]
["5421","E07",0.1826209]
["5421","E09",0.1165455]
["5421","E10",0.1551865]
["5421","E11",1.4091832]
["5421","E12",4.8209000000000002E-2]
["5421","E15",0.35158374999999997]
["5421","E18",1.4212228999999998]
["5421","E19",1.0254909999999999]
["5421","E21",9.5725000000000005E-2]
["5421","E23",0.41906504999999999]
["5421","E25",0.1883985]
["5421","E26",9.7155199999999997E-2]
["5421","E27",0.6422445]
["5421","E28",0.43533820000000001]
["5421","E30",0.7939408]
["5441","E04",9.1359508000000016]
["5441","E07",0.57882299999999998]
["5441","E09",0.61612919999999993]
["5441","E10",0.5296535]
["5441","E11",2.9615443999999997]
["5441","E12",0.73060400000000003]
["5441","E15",1.414385]
["5441","E18",3.1593805000000001]
["5441","E19",3.1761576000000002]
["5441","E21",0.41448924999999998]
["5441","E23",0.87470684999999992]
["5441","E25",0.50445499999999999]
["5441","E26",0.23136960000000001]
["5441","E27",2.5219844999999999]
["5441","E28",1.3060146000000001]
["5441","E30",1.238076]
["5461","E04",3.9746610000000002]
["5461","E07",3.7522537499999999]
["5461","E09",2.4217434]
["5461","E10",1.6034474999999999]
["5461","E11",2.6479163999999997]
["5461","E12",3.7341605000000002]
["5461","E14",1.7277039999999999]
["5461","E15",0.1485225]
["5461","E18",11.66578825]
["6562","C35",0.31367785999999998]
["6562","C76",0.47904338000000002]
["6562","E05",2.2307774]
["6562","E10",0.50572799999999996]
["6570","2421",13.552717269999999]
["6570","296",9.6469825]
["6570","3072",38.41030035]
["6570","4345",49.710334369999998]
["6570","4804",15.25347227]
["6570","5093",11.49287693]
["6570","5501",1.7365902499999999]
["6570","5546",5.7151551700000001]
["6570","650",29.282687489999997]
["6570","C35",2.54086598]
["6573","2421",5.3515908699999999]
["6573","4345",4.0931748299999997]
["6573","4804",9.5739597200000013]
["6573","5093",4.1520566099999998]
["6573","5546",0.96149178000000002]
["6573","650",1.8721264199999998]
["6580","296",5.0948608099999992]
["6580","299",2.8785037999999998]
["6580","5501",4.262382E-2]
["6580","C19",5.12920716]
["6580","C35",2.4624425200000002]
["6580","C76",3.3709051699999999]
["6580","E10",3.185384]
["6586","302",1.13531856]
["6586","4804",3.4103016099999999]
["6592","2421",29.346238449999998]
["6592","296",6.2066389600000003]
["6592","4345",6.7941496500000005]
["6592","4804",21.279939030000001]
["6592","5093",10.19921254]
["6592","5501",1.2939018]
["6592","5546",2.89146357]
["6592","650",14.964492570000001]
["6592","C35",2.9716067799999997]
["6602","5044",0.89549612000000001]
["6602","C19",3.5730926200000002]
["6602","C76",1.5005166299999999]
["724","4710",4.2153409100000001]
["724","4762",3.3814792499999999]
["724","5093",25.377067719999999]
["724","5960",4.3069847999999995]
["724","E27",8.5347506099999997]
["734","5968",5.9036999999999997]
["740","4710",5.8021782300000009]
["740","4762",4.1416167999999995]
["740","5093",17.53425927]
["740","E27",4.1825259299999997]
["C11","2891",82.49936932]
["C12","2898",443.48814519999996]
["C13","2905",481.71497335000004]
["C14","2912",531.26338882000005]
["C17","5519",0.41048137000000001]
["C17","5968",1.0990721499999998]
["C36","2421",9.4315066899999991]
["C36","307",0.2393132]
["C36","3864",7.6321460000000008E-2]
["C36","3914",23.822741600000001]
["C36","3997",3.7130000000000005E-5]
["C36","3999",3.4700000000000002E-6]
["C36","4773",75.792978349999998]
["C36","4775",1.10411835]
["C36","4798",7.5675770000000003E-2]
["C36","5014",79.572916810000009]
["C36","5515",3.59500478]
["C36","5517",10.13004578]
["C36","5546",5.7100702600000002]
["C36","5976",3.3318370900000001]
["C36","5985",1.66448789]
["C36","5986",1.9187738000000001]
["C44","5988",2.461109]
["C50","E05",26.153710520000001]
["C51","2238",197.97887845]
["C513","650",137.57254302999999]
["C515","724",334.44434017999998]
["C516","612",7.1075585300000004]
["C517","086",99.497340309999998]
["C57","2947",22.747923350000001]
["C58","2946",101.31455602]
["C62","4444",663.34698221000008]
["C655","6562",5.2091010000000004]
["C656","6570",111.37081045000001]
["C657","6580",9.1521476800000006]
["C659","6602",3.0948571400000002]
["C98","3072",197.2187471]
["E01","E03",0.67219580000000001]
["E01","E27",2.18300472]
["E01","E28",1.1549322399999999]
["E01","E29",2.5241250000000002]
["E01","E30",0.84503600000000001]
["E02","E27",5.3227970999999998]
["E02","E29",5.5530749999999998]
["E02","E30",6.809418]
["E04","E27",0.84943362]
["E12","E19",2.360348E-2]
["E12","E21",1.2252799999999999E-2]
["E13","E03",0.28251999999999999]
["E13","E26",3.9463039999999998E-2]
["E15","E03",6.8813800000000008E-2]
["E15","E11",0.33622479999999999]
["E20","E19",4.1522646200000004]
["E22","E21",1.98552795]
["Q46","1292",29.412177510000003]
["Q46","307",5.8430464999999998]
["Q46","3085",23.52908459]
["Q46","3086",14.688603499999999]
["Q46","4853",26.569179399999999]
["Q47","1292",109.40986015]
["Q85","1537",7.7161413200000002]
["Q85","2946",3.28531453]
["Q85","2947",3.80823921]
["Q85","4853",2.750661]
["Q85","653",4.8830664500000003]
["Q85","C76",8.8067822100000015]
["Q85","C96",7.1399778200000004]
["S721","756",1.86596593]
["S765","302",5.2547990799999997]
["S769","291",11.68708539]
["S771","613",4.3596624000000004]
["S773","611",14.14981281]
["S774","612",7.49066163]
["S777","724",11.633510830000001]
["S778","650",9.6424326199999992]
["S781","734",1.3029710400000001]
["S782","086",4.6479234199999997]
["S787","740",9.7127503900000001]
["S788","738",9.8100694499999985]
["S789","736",10.87468964]
["S890","307",1.4219838300000001]
["S891","3072",0.26336040000000005]
[null,null,0]
[null,null,0]
[null,null,0]
[null,null,0]
[null,null,0]
[null,null,0]
[null,null,0]
[null,null,0]
[null,null,0]
[null,null,0]
[null,null,0]
[null,null,0]
[null,null,0]
[null,null,0]
[null,null,0]
[null,null,0]
[null,null,0]
[null,null,0]
[null,null,0]
[null,null,0]
[null,null,0]
[null,null,0]
[null,null,0]
[null,null,0]
[null,null,0]
[null,null,0]
[null,null,0]
[null,null,0]
[null,null,0]
[null,null,0]
[null,null,0]
[null,null,0]
[null,null,0]
[null,null,0]
[null,null,0]
[null,null,0]
[null,null,0]
[null,null,0]
[null,null,0]
[null,null,0]
[null,null,0]
[null,null,0]
[null,null,0]
[null,null,0]
[null,null,0]
[null,null,0]

{"sheet":"FundDecompositions","index":3,"n_rows":1144,"n_cols":86,"rows_kept":1144,"cut":false,"hidden":true,"merged":[]}
["MPower fund code","NAV\n(millions)","NAV in UF\n(millions)",1,{"$f":"D1+1","v":2},{"$f":"E1+1","v":3},4,5,6,7,8,9,10,11,12,13,14,15,16,17,18,19,20,{"$f":"W1+1","v":21},{"$f":"X1+1","v":22},{"$f":"Y1+1","v":23},{"$f":"Z1+1","v":24},{"$f":"AA1+1","v":25},{"$f":"AB1+1","v":26},{"$f":"AC1+1","v":27},{"$f":"AD1+1","v":28},{"$f":"AE1+1","v":29},{"$f":"AF1+1","v":30},{"$f":"AG1+1","v":31},{"$f":"AH1+1","v":32},{"$f":"AI1+1","v":33},{"$f":"AJ1+1","v":34},{"$f":"AK1+1","v":35},{"$f":"AL1+1","v":36},{"$f":"AM1+1","v":37},{"$f":"AN1+1","v":38},{"$f":"AO1+1","v":39},{"$f":"AP1+1","v":40},{"$f":"AQ1+1","v":41},1,{"$f":"AS1+1","v":2},{"$f":"AT1+1","v":3},4,5,6,7,8,9,10,11,12,13,14,15,16,17,18,19,20,{"$f":"BL1+1","v":21},{"$f":"BM1+1","v":22},{"$f":"BN1+1","v":23},{"$f":"BO1+1","v":24},{"$f":"BP1+1","v":25},{"$f":"BQ1+1","v":26},{"$f":"BR1+1","v":27},{"$f":"BS1+1","v":28},{"$f":"BT1+1","v":29},{"$f":"BU1+1","v":30},{"$f":"BV1+1","v":31},{"$f":"BW1+1","v":32},{"$f":"BX1+1","v":33},{"$f":"BY1+1","v":34},{"$f":"BZ1+1","v":35},{"$f":"CA1+1","v":36},{"$f":"CB1+1","v":37},{"$f":"CC1+1","v":38},{"$f":"CD1+1","v":39},{"$f":"CE1+1","v":40},{"$f":"CF1+1","v":41}]
["086",1697.0676010000002,28.8172,"086","4762","E03","E11","E27","E28","E29","E30","5960","E27","E29","E30",null,null,null,null,null,null,null,null,null,null,null,null,null,null,null,null,null,null,null,null,null,null,null,null,null,null,null,null,null,1,4.8599196482614608E-4,2.4726714744278768E-3,5.0978095965104706E-2,1.8026650687312077E-2,7.0864759372476299E-2,9.0749394997511945E-2,8.4050698929017519E-3,3.8546184787001739E-4,3.7700101852573198E-5,1.5617082866679462E-4,7.5271297354039495E-5]
["1081",24.228867000000001,0,"1081",null,null,null,null,null,null,null,null,null,null,null,null,null,null,null,null,null,null,null,null,null,null,null,null,null,null,null,null,null,null,null,null,null,null,null,null,null,null,null,null,1]
["1216",178.87036699999999,178.7715,"1216","1238","307","3091","3092","5025","5026","Q123",null,null,null,null,null,null,null,null,null,null,null,null,null,null,null,null,null,null,null,null,null,null,null,null,null,null,null,null,null,null,null,null,null,1,0.18306380278152701,4.0979989637030126E-3,0.19590563633246266,0.11641384054875235,0.13134258696969139,8.5693411383630735E-2,0.21892391351989893]
["1219",93.039925999999994,93.034700000000001,"1219","1234","3069","3091","3092","4762","5027","5253","5960","E27","E29","E30",null,null,null,null,null,null,null,null,null,null,null,null,null,null,null,null,null,null,null,null,null,null,null,null,null,null,null,null,null,1,0.12831572315729384,1.9381199839379033E-2,2.623190192749764E-2,8.9006576483897315E-2,4.0819930003153076E-3,7.9567062863781846E-2,0.25369818863953347,3.2376102462041449E-3,3.1665451902775717E-4,1.311725862997232E-3,6.3222631475760383E-4]
["1232",57.885778000000002,57.863999999999997,"1232","2979",null,null,null,null,null,null,null,null,null,null,null,null,null,null,null,null,null,null,null,null,null,null,null,null,null,null,null,null,null,null,null,null,null,null,null,null,null,null,null,1,8.6524795370029634E-2]
["1234",28.904487,0,"1234",null,null,null,null,null,null,null,null,null,null,null,null,null,null,null,null,null,null,null,null,null,null,null,null,null,null,null,null,null,null,null,null,null,null,null,null,null,null,null,null,1]
["1237",127.06736600000001,127.2675,"1237","1238","307","3091","3092","5025","5026","5027","Q123",null,null,null,null,null,null,null,null,null,null,null,null,null,null,null,null,null,null,null,null,null,null,null,null,null,null,null,null,null,null,null,null,1,0.23433795757262663,2.9044198837786367E-3,4.9056990759752145E-2,3.453232091896196E-2,0.20308617945281759,0.16808537486281608,0.25275185066007544,7.5072823390785595E-2]
["1238",48.973068999999995,0,"1238",null,null,null,null,null,null,null,null,null,null,null,null,null,null,null,null,null,null,null,null,null,null,null,null,null,null,null,null,null,null,null,null,null,null,null,null,null,null,null,null,1]
["1240",6.0320479999999996,0,"1240",null,null,null,null,null,null,null,null,null,null,null,null,null,null,null,null,null,null,null,null,null,null,null,null,null,null,null,null,null,null,null,null,null,null,null,null,null,null,null,null,1]
["1241",4.5679580000000009,0,"1241",null,null,null,null,null,null,null,null,null,null,null,null,null,null,null,null,null,null,null,null,null,null,null,null,null,null,null,null,null,null,null,null,null,null,null,null,null,null,null,null,1]
["1259",24.994195999999995,21.180800000000001,"1259","1292","307","3085","3086","3092","4853","5025",null,null,null,null,null,null,null,null,null,null,null,null,null,null,null,null,null,null,null,null,null,null,null,null,null,null,null,null,null,null,null,null,null,1,5.5902643583866244E-3,5.6925813821798123E-4,1.2326064903626989E-2,2.2050096025058641E-2,3.4030755969937557E-2,1.2763014676500361E-2,3.3661894271779902E-2]
["1260",19.621185000000001,0.7883,"1260","4324","5093",null,null,null,null,null,null,null,null,null,null,null,null,null,null,null,null,null,null,null,null,null,null,null,null,null,null,null,null,null,null,null,null,null,null,null,null,null,null,1,4.0930792430295826E-4,2.5433249272283132E-3]
["1261",14.818187999999999,0.26090000000000002,"1261","E29","E30",null,null,null,null,null,null,null,null,null,null,null,null,null,null,null,null,null,null,null,null,null,null,null,null,null,null,null,null,null,null,null,null,null,null,null,null,null,null,1,2.8627569399846038E-3,2.4480786095830345E-4]
["1262",21.985382000000001,0,"1262",null,null,null,null,null,null,null,null,null,null,null,null,null,null,null,null,null,null,null,null,null,null,null,null,null,null,null,null,null,null,null,null,null,null,null,null,null,null,null,null,1]
["1263",17.535905,0,"1263",null,null,null,null,null,null,null,null,null,null,null,null,null,null,null,null,null,null,null,null,null,null,null,null,null,null,null,null,null,null,null,null,null,null,null,null,null,null,null,null,1]
["1264",16.02975,0,"1264",null,null,null,null,null,null,null,null,null,null,null,null,null,null,null,null,null,null,null,null,null,null,null,null,null,null,null,null,null,null,null,null,null,null,null,null,null,null,null,null,1]
["1265",8.1707820000000009,0,"1265",null,null,null,null,null,null,null,null,null,null,null,null,null,null,null,null,null,null,null,null,null,null,null,null,null,null,null,null,null,null,null,null,null,null,null,null,null,null,null,null,1]
["1266",10.884532999999999,0,"1266",null,null,null,null,null,null,null,null,null,null,null,null,null,null,null,null,null,null,null,null,null,null,null,null,null,null,null,null,null,null,null,null,null,null,null,null,null,null,null,null,1]
["1268",7.4110340000000008,0,"1268",null,null,null,null,null,null,null,null,null,null,null,null,null,null,null,null,null,null,null,null,null,null,null,null,null,null,null,null,null,null,null,null,null,null,null,null,null,null,null,null,1]
["2167",4.1487150000000002,4.1502999999999997,"2167","5515",null,null,null,null,null,null,null,null,null,null,null,null,null,null,null,null,null,null,null,null,null,null,null,null,null,null,null,null,null,null,null,null,null,null,null,null,null,null,null,1,6.1609189839933381E-2]
["1292",445.16835800000001,0,"1292",null,null,null,null,null,null,null,null,null,null,null,null,null,null,null,null,null,null,null,null,null,null,null,null,null,null,null,null,null,null,null,null,null,null,null,null,null,null,null,null,1]
["1360",134.48946899999999,0,"1360",null,null,null,null,null,null,null,null,null,null,null,null,null,null,null,null,null,null,null,null,null,null,null,null,null,null,null,null,null,null,null,null,null,null,null,null,null,null,null,null,1]
["1537",881.60337600000014,0,"1537",null,null,null,null,null,null,null,null,null,null,null,null,null,null,null,null,null,null,null,null,null,null,null,null,null,null,null,null,null,null,null,null,null,null,null,null,null,null,null,null,1]
["1870",246.625573,231.0598,"1870","2979","307","3864","3914","3997","4773","4775","4798","5213","5546","5976","5985","C35","E25","E27","E30","4710","E27","E26","4762","E03","E11","E27","E28","E29","E30","5960","E27","E29","E30",null,null,null,null,null,null,null,null,null,null,1,1.6726849228545122E-2,9.6575503421955783E-3,6.891498983687247E-2,2.0854185649561647E-3,2.0769663874090644E-4,8.7579657347509948E-11,1.26588670435828E-3,6.467257354120047E-2,0.18308175770840443,8.7057239751931019E-3,1.9074321132031339E-2,3.2321246246122301E-2,1.3621378234558749E-8,0.12475561874909114,2.0750607561241096E-3,1.0689943261845917E-2,1.977878415524536E-3,3.8963655350855329E-3,1.3446511457230905E-2,1.4593509623641979E-6,3.3022848474428012E-6,5.4346159089108482E-5,1.8567064313020567E-5,9.4640578295544333E-5,8.974563479374459E-5,9.9261037748732817E-6,1.1574761711235774E-6,1.1320697439815174E-7,4.6895435645655288E-7,2.26026865014764E-7]
["2238",2233.4545119999998,253.0093,"2238","4710","4762","5093","5218","5960","618","E03","E11","E27","4762","E03","E11","E27","E28","E29","E30","5960","E27","E29","E30","5960","E27","E29","E30",null,null,null,null,null,null,null,null,null,null,null,null,null,null,null,null,1,5.7492222593219282E-2,6.280232338321236E-4,3.8126806836742314E-2,6.4578294407425432E-3,1.5526482626381718E-2,0.13955002454294271,2.1549948947686148E-2,0.72668232617142392,6.6920357679789627E-2,4.2419862470474706E-5,9.5989568431104356E-5,1.5797136218855571E-3,5.3970041131355597E-4,2.7509765772308335E-3,2.6086922086984684E-3,2.8852823471308547E-4,4.9811316593440663E-4,4.8717965717238275E-5,2.0181179103372348E-4,9.72693521711494E-5,3.3645080078866139E-5,3.2906575652565318E-6,1.3631388075141052E-5,6.5700635253811112E-6]
["2309",1474.3527359999996,51.950699999999998,"2309","4762","5218","E03","E11","E27","E28","E29","E30","5960","E27","E29","E30",null,null,null,null,null,null,null,null,null,null,null,null,null,null,null,null,null,null,null,null,null,null,null,null,null,null,null,null,1,7.2876106391577119E-4,7.9281388407294717E-3,4.7479016817376729E-3,7.8346838219729445E-2,2.6957149453329596E-2,0.13606667016521914,0.12825151091131026,1.3423631042546971E-2,5.7801282054772822E-4,5.6532552643421965E-5,2.3418333529965783E-4,1.128718059395764E-4]
["2421",2501.0997029999999,18.244700000000002,"2421","5218",null,null,null,null,null,null,null,null,null,null,null,null,null,null,null,null,null,null,null,null,null,null,null,null,null,null,null,null,null,null,null,null,null,null,null,null,null,null,null,1,2.0311836395069831E-2]
["2802",46.645713999999998,0,"2802",null,null,null,null,null,null,null,null,null,null,null,null,null,null,null,null,null,null,null,null,null,null,null,null,null,null,null,null,null,null,null,null,null,null,null,null,null,null,null,null,1]
["2891",838.38022100000001,781.94820000000004,"2891","2421","2979","307","3864","3914","3997","3999","4773","4775","4798","5014","5213","5515","5517","5546","5976","5985","5986","E27","E30","5218","4710","E27","E26","4762","E03","E11","E27","E28","E29","E30","5960","E27","E29","E30",null,null,null,null,null,1,1.1620895764371168E-2,2.282873946981253E-2,2.5935341629772141E-2,4.07896610693778E-2,0.10683282690627868,4.1531248515639961E-2,0.19950769157237083,0.20557049126057192,0.24222882864740145,4.2572469282920372E-4,0.13554502849532532,3.2819959883882699E-2,0.25492683427916579,0.18969350034892404,6.7320967637255216E-2,0.1012138170541024,8.2043060588700478E-2,0.15427100463027923,4.6920992453308046E-2,2.0849469491615511E-2,2.360417335300671E-4,1.1706740492402738E-3,2.306195356841055E-3,2.410474818072105E-3,8.6376608742176365E-7,1.9545686649679233E-6,3.2166607220206805E-5,1.0989543235428836E-5,5.601621825995989E-5,5.3118980853921171E-5,5.8750993024150937E-6,6.8509131072599897E-7,6.7005365992518582E-8,2.7756645255480273E-7,1.3378162339354173E-7]
["2898",2242.2744860000003,2149.9169999999999,"2898","2421","2979","307","3864","3914","3997","3999","4324","4773","4775","4798","5014","5213","5515","5517","5546","5976","5985","5986","E27","E30","5218","4710","E27","E26","4762","E03","E11","E27","E28","E29","E30","5960","E27","E29","E30",null,null,null,null,1,2.369893174190537E-2,0.15455095321028195,7.3892862513136454E-2,0.16412910658533605,0.24863846703738759,0.22556803423231125,0.41378979992780679,9.436162066030051E-9,0.40295169174704776,0.31468795172100439,4.4572985961938989E-2,0.32674876486041693,0.1314351555306314,0.31277076642861279,0.31980797286327262,0.19019193238998749,0.28592163862143044,0.260574823470754,0.3320824583352821,0.27634181988166701,6.0957157378617559E-2,4.813688242795091E-4,4.7105487215899225E-3,9.2796501271675425E-3,9.6533065164276077E-3,3.4756149600290827E-6,7.8647775031824194E-6,1.2943173261367074E-4,4.4219634724201243E-5,2.2539760361476929E-4,2.1373972329529441E-4,2.3640176807682147E-5,2.756664846211488E-6,2.6961564691773721E-7,1.1168696351360919E-6,5.3830940854769979E-7]
["2905",2282.345832,2152.9180999999999,"2905","2421","2979","307","3864","3914","3997","3999","4773","4775","4798","5014","5213","5515","5517","5546","5976","5985","5986","E27","E30","5218","4710","E27","E26","4762","E03","E11","E27","E28","E29","E30","5960","E27","E29","E30",null,null,null,null,null,1,1.207619806599473E-2,0.16851080721680364,0.13997246088531443,0.26893836944267308,0.34772971890802828,0.23092088217187109,9.1208623949025319E-2,0.18746688826266189,0.11925058537394528,9.4770546177968207E-2,0.197604525119987,0.17714264047812328,0.15922393220882439,0.26573039860755915,0.17620560915515529,0.28437527679240465,0.23371639522079157,0.25611825452504561,7.656622484885061E-3,0.18303467737649154,2.4528975939094367E-4,7.7186022559989197E-3,1.520543202921391E-2,1.3010310664304244E-2,5.6950667654721458E-6,1.2887052648614567E-5,2.1208401024934751E-4,7.2457327694610136E-5,3.6933159056053659E-4,3.5022924247916638E-4,3.873627741152013E-5,4.5170108109653958E-6,4.417863105870707E-7,1.8300781915081108E-6,8.8206204007572796E-7]
["2912",1709.8840790000002,1673.7276999999999,"2912","2421","2979","302","307","3864","3914","3997","3999","4773","4775","4798","5014","5213","5515","5517","5546","5976","5985","5986","E27","E30","5218","E27","4710","E27","E26","4762","E03","E11","E27","E28","E29","E30","5960","E27","E29","E30",null,null,null,1,9.1479142914614713E-3,0.15129065860951657,5.6425062831446319E-9,0.15694214150852934,0.25156579534190959,0.16129139124233724,0.24051056349461403,0.16506932017115214,5.1052465980411924E-2,0.17682663766287587,9.1741815134627133E-2,0.17379627443584306,9.3738562747229734E-2,9.9272259621736275E-2,6.803403107967064E-2,0.10858021321432004,0.17142221927693102,0.19945735066624623,0.13097309916904415,5.5344332302320325E-2,4.9247181362778711E-2,1.8581093844428654E-4,3.788368659756358E-10,7.2200047895067138E-3,1.4223208870766639E-2,6.8846654835623801E-3,5.3271833370234954E-6,1.2054589517591459E-5,1.9838404920890826E-4,6.7776811868153336E-5,3.4547392964713743E-4,3.2760553326343641E-4,3.6234035536870815E-5,4.2252260976496064E-6,4.132483022943834E-7,1.7118608874542059E-6,8.2508360228553149E-7,null,null,null,4.2717240281595108E-7]
["291",1199.859056,80.712100000000007,"291","4710","4762","5093","5218","E27","4762","E03","E11","E27","E28","E29","E30","5960","E27","E29","E30","5960","E27","E29","E30",null,null,null,null,null,null,null,null,null,null,null,null,null,null,null,null,null,null,null,null,1,3.5485630215968955E-2,2.8379026745040887E-3,0.3100181485904035,2.5802488131965004E-3,5.0553755597376841E-2,2.618259454135387E-5,5.9247149897773383E-5,9.7503855138784197E-4,3.3311652184304257E-4,1.6979711889572829E-3,1.6101497366023058E-3,1.7808680517253833E-4,2.2508668623378012E-3,2.201460674658835E-4,9.1194432095510335E-4,4.3953939886812095E-4,2.0766580528861308E-5,2.0310757222638001E-6,8.4136318748246607E-6,4.0552066738953432E-6,null,null,null,null,null,null,null,null,null,null,null,null,null,null,null,null,null,null,null,null,9.1966355590710696E-7]
["292",93.137983000000006,1.4693000000000001,"292","5519",null,null,null,null,null,null,null,null,null,null,null,null,null,null,null,null,null,null,null,null,null,null,null,null,null,null,null,null,null,null,null,null,null,null,null,null,null,null,null,1,9.5519353140033805E-2]
["2946",725.95207299999993,29.540099999999999,"2946","E19",null,null,null,null,null,null,null,null,null,null,null,null,null,null,null,null,null,null,null,null,null,null,null,null,null,null,null,null,null,null,null,null,null,null,null,null,null,null,null,1,0.14745152290357733]
["2947",133.55059800000001,1.8366,"2947","5519",null,null,null,null,null,null,null,null,null,null,null,null,null,null,null,null,null,null,null,null,null,null,null,null,null,null,null,null,null,null,null,null,null,null,null,null,null,null,null,1,0.11939919191262516]
["296",490.34629700000005,23.647200000000002,"296","5519","5968",null,null,null,null,null,null,null,null,null,null,null,null,null,null,null,null,null,null,null,null,null,null,null,null,null,null,null,null,null,null,null,null,null,null,null,null,null,null,1,0.41789717071902222,0.70269809788486093]
["2979",668.75587599999994,0,"2979",null,null,null,null,null,null,null,null,null,null,null,null,null,null,null,null,null,null,null,null,null,null,null,null,null,null,null,null,null,null,null,null,null,null,null,null,null,null,null,null,1]
["299",104.503237,0,"299",null,null,null,null,null,null,null,null,null,null,null,null,null,null,null,null,null,null,null,null,null,null,null,null,null,null,null,null,null,null,null,null,null,null,null,null,null,null,null,null,1]
["302",1472.7498089999999,19.935500000000001,"302","E27",null,null,null,null,null,null,null,null,null,null,null,null,null,null,null,null,null,null,null,null,null,null,null,null,null,null,null,null,null,null,null,null,null,null,null,null,null,null,null,1,6.7139821732640728E-2]
["3069",1607.7601870000001,0,"3069",null,null,null,null,null,null,null,null,null,null,null,null,null,null,null,null,null,null,null,null,null,null,null,null,null,null,null,null,null,null,null,null,null,null,null,null,null,null,null,null,1]
["3072",2724.7192550000004,3.0918999999999999,"3072","5218",null,null,null,null,null,null,null,null,null,null,null,null,null,null,null,null,null,null,null,null,null,null,null,null,null,null,null,null,null,null,null,null,null,null,null,null,null,null,null,1,3.442253733750998E-3]
["3077",273.56120699999997,273.71879999999999,"3077","1234","1238","1292","1360","302","3069","3085","3091","4762","4853","5026","5027","5253","611","Q88","E27","5960","E27","E29","E30",null,null,null,null,null,null,null,null,null,null,null,null,null,null,null,null,null,null,null,null,1,0.28263259146499681,0.14026124157956102,2.1401833036666575E-2,6.1493158127586163E-2,3.9981319888822933E-2,4.6022060839669997E-2,5.9250403360604435E-2,5.7916113564170188E-2,7.1829449815760558E-3,5.3753022877525522E-2,4.8602792336406339E-2,0.19583718880396689,0.39818653733182924,1.8786613700808169E-3,3.5459517064822553E-2,2.6843386899712551E-3,5.6971132161360736E-3,5.5720624414792397E-4,2.3081996230987401E-3,1.1125072567389686E-3]
["3078",242.602957,242.77250000000001,"3078","1234","1238","1292","1360","302","3069","3085","3087","3091","4762","4853","5026","5027","5253","611","Q88","E27","5960","E27","E29","E30",null,null,null,null,null,null,null,null,null,null,null,null,null,null,null,null,null,null,null,1,0.20865879188361672,0.14876249002003139,2.9821815474773142E-2,9.1694561211098258E-2,3.1281252830589419E-2,3.0930630295488096E-2,6.7458565466477383E-2,7.4146352553744202E-2,3.8466913266134099E-2,4.2425678386600035E-3,6.9058339074804534E-2,6.5613846429784919E-2,0.1499151522141097,0.26400133959945365,3.5986856264153713E-3,3.1573226959342997E-2,2.100217738619437E-3,3.3649692940680691E-3,3.2911087262759727E-4,1.3633256987605632E-3,6.5709643047843515E-4]
["3079",574.07518900000002,574.17160000000001,"3079","1292","1360","1537","2946","302","3069","3085","3087","3091","4762","4853","5026","5027","611","C55","Q88","E19","E27","5960","E27","E29","E30",null,null,null,null,null,null,null,null,null,null,null,null,null,null,null,null,null,null,1,8.9650480896667425E-2,0.34950193137754249,2.9494164337387989E-2,2.3665385939375339E-2,5.2308529656564885E-2,6.0332113364915993E-2,0.17695473541690313,0.17562870246885801,5.0364639153362992E-2,7.5176264054318074E-3,0.22917107609771373,0.22587298586783697,0.21699219793529476,6.5596457286835929E-3,4.3241697253044442E-2,0.14862987099994057,3.4894971968617997E-3,3.5119853562383175E-3,5.962563942535133E-3,5.8316865645249719E-4,2.4157476466995691E-3,1.1643433091785011E-3]
["307",868.66986899999995,0,"307",null,null,null,null,null,null,null,null,null,null,null,null,null,null,null,null,null,null,null,null,null,null,null,null,null,null,null,null,null,null,null,null,null,null,null,null,null,null,null,null,1]
["3080",369.71291500000001,369.73219999999998,"3080","1292","1360","1537","2946","296","302","3069","3085","3087","3998","4853","5026","5027","611","653","C55","Q88","E19","5519","5968","E27",null,null,null,null,null,null,null,null,null,null,null,null,null,null,null,null,null,null,null,1,3.3122895537958219E-2,0.22304819907873849,2.5296075139909852E-2,2.2908303867431475E-2,3.0171543295014154E-2,2.2389972390422324E-2,1.822145482267816E-2,0.17156841773608239,0.20796108275890279,0.53016984091410224,0.17911550276353636,0.13313989367432688,0.10493826975575121,4.2145792859534376E-3,2.9902385418190264E-2,3.6393898456086059E-2,0.10436936700905859,3.3778642923906811E-3,1.26086025792129E-2,2.1201486083657177E-2,1.5032587548917025E-3]
["3081",261.61813100000001,261.67939999999999,"3081","1292","1360","1537","2946","296","3085","3086","3087","3998","4853","5026","611","653","C55","E19","5519","5968",null,null,null,null,null,null,null,null,null,null,null,null,null,null,null,null,null,null,null,null,null,null,null,1,3.495667147533383E-2,0.2177090920109005,2.2219149234224824E-2,2.331790439066159E-2,2.9419774759185495E-2,0.19404805756145302,0,0.23969351152611018,0.46846014647036066,0.14177367425708942,9.4392743311285249E-2,3.8666466256381043E-3,3.449119385422697E-2,3.5272532506917781E-2,3.4382605133230632E-3,1.2294440635054523E-2,2.0673219763480688E-2]
["3085",161.23292199999997,0,"3085",null,null,null,null,null,null,null,null,null,null,null,null,null,null,null,null,null,null,null,null,null,null,null,null,null,null,null,null,null,null,null,null,null,null,null,null,null,null,null,null,1]
["3086",56.44359,0,"3086",null,null,null,null,null,null,null,null,null,null,null,null,null,null,null,null,null,null,null,null,null,null,null,null,null,null,null,null,null,null,null,null,null,null,null,null,null,null,null,null,1]
["3087",97.778013999999999,0,"3087",null,null,null,null,null,null,null,null,null,null,null,null,null,null,null,null,null,null,null,null,null,null,null,null,null,null,null,null,null,null,null,null,null,null,null,null,null,null,null,null,1]
["3091",283.455625,0,"3091",null,null,null,null,null,null,null,null,null,null,null,null,null,null,null,null,null,null,null,null,null,null,null,null,null,null,null,null,null,null,null,null,null,null,null,null,null,null,null,null,1]
["3092",292.59096199999999,0,"3092",null,null,null,null,null,null,null,null,null,null,null,null,null,null,null,null,null,null,null,null,null,null,null,null,null,null,null,null,null,null,null,null,null,null,null,null,null,null,null,null,1]
["3093",246.61826100000002,0,"3093",null,null,null,null,null,null,null,null,null,null,null,null,null,null,null,null,null,null,null,null,null,null,null,null,null,null,null,null,null,null,null,null,null,null,null,null,null,null,null,null,1]
["3102",150.34740500000001,0,"3102",null,null,null,null,null,null,null,null,null,null,null,null,null,null,null,null,null,null,null,null,null,null,null,null,null,null,null,null,null,null,null,null,null,null,null,null,null,null,null,null,1]
["3864",1980.7387229999999,22.881900000000002,"3864","4710","E27","4762","E03","E11","E27","E28","E29","E30","5960","E27","E29","E30",null,null,null,null,null,null,null,null,null,null,null,null,null,null,null,null,null,null,null,null,null,null,null,null,null,null,null,1,2.8700264198055297E-2,5.653872320533683E-2,2.1176103570770353E-5,4.7918237458346651E-5,7.8859707035799269E-4,2.6941982226175106E-4,1.3732945259016429E-3,1.3022658061211353E-3,1.4403403088891395E-4,1.6795709813836148E-5,1.642704652008541E-6,6.8048237047789883E-6,3.2797924740290671E-6]
["3914",1380.4093610000002,0,"3914",null,null,null,null,null,null,null,null,null,null,null,null,null,null,null,null,null,null,null,null,null,null,null,null,null,null,null,null,null,null,null,null,null,null,null,null,null,null,null,null,1]
["3997",1077.9056409999998,0,"3997",null,null,null,null,null,null,null,null,null,null,null,null,null,null,null,null,null,null,null,null,null,null,null,null,null,null,null,null,null,null,null,null,null,null,null,null,null,null,null,null,1]
["3998",27.664302999999997,0,"3998",null,null,null,null,null,null,null,null,null,null,null,null,null,null,null,null,null,null,null,null,null,null,null,null,null,null,null,null,null,null,null,null,null,null,null,null,null,null,null,null,1]
["3999",70.089717000000007,0,"3999",null,null,null,null,null,null,null,null,null,null,null,null,null,null,null,null,null,null,null,null,null,null,null,null,null,null,null,null,null,null,null,null,null,null,null,null,null,null,null,null,1]
["4324",935.76181199999996,0,"4324",null,null,null,null,null,null,null,null,null,null,null,null,null,null,null,null,null,null,null,null,null,null,null,null,null,null,null,null,null,null,null,null,null,null,null,null,null,null,null,null,1]
["4345",325.03024100000005,17.128599999999999,"4345","5093","5960","E27",null,null,null,null,null,null,null,null,null,null,null,null,null,null,null,null,null,null,null,null,null,null,null,null,null,null,null,null,null,null,null,null,null,null,null,null,null,1,7.0891219144585224E-2,2.5446179859903374E-2,1.5552404514543748E-2]
["4444",1384.4625260000003,1321.1029000000001,"4444","2421","2979","307","3864","3914","3997","3999","4773","4775","4798","5014","5213","5515","5517","5546","5976","5985","5986","E27","E30","5218","4710","E27","E26","4762","E03","E11","E27","E28","E29","E30","5960","E27","E29","E30",null,null,null,null,null,1,6.2936225253235603E-3,0.1446537590472099,6.6210703686175848E-2,0.20560049947022291,0.11620906890376145,0.26124934960909374,0.13032431641168388,4.2329805619869834E-2,0.13939418248754662,6.0453849097255388E-2,9.2718063379477425E-2,0.25953720085022652,5.8682408703539045E-2,5.3691590320460787E-2,6.4877623353418151E-2,0.10787728920594082,0.16440354329733681,5.1766464774020547E-2,1.1184225770296048E-2,7.0096650854394218E-2,1.2783503106669839E-4,5.9007886540475268E-3,1.1624389730425934E-2,1.9061811446930442E-2,4.3538174709835558E-6,9.8520135551688162E-6,1.6213595154635787E-4,5.5392850024194709E-5,2.8235004044510083E-4,2.6774650018149791E-4,2.9613468691470233E-5,3.4532063266816372E-6,3.3774089693501471E-7,1.3990751525093727E-6,6.7432697081905423E-7]
["4710",212.34066899999999,16.906600000000001,"4710","4762","E03","E11","E27","E28","E29","E30","5960","E27","E29","E30",null,null,null,null,null,null,null,null,null,null,null,null,null,null,null,null,null,null,null,null,null,null,null,null,null,null,null,null,null,1,7.3783653783247144E-4,1.6696096289452813E-3,2.7476996898566086E-2,9.3873638375777287E-3,4.7849543001583096E-2,4.5374697498755973E-2,5.0185611496452211E-3,5.8521098265618783E-4,5.7236568997154012E-5,2.37099688623775E-4,1.1427743143393441E-4]
["4721",50.265392999999996,0,"4721",null,null,null,null,null,null,null,null,null,null,null,null,null,null,null,null,null,null,null,null,null,null,null,null,null,null,null,null,null,null,null,null,null,null,null,null,null,null,null,null,1]
["4732",168.16153700000001,0,"4732",null,null,null,null,null,null,null,null,null,null,null,null,null,null,null,null,null,null,null,null,null,null,null,null,null,null,null,null,null,null,null,null,null,null,null,null,null,null,null,null,1]
["4762",2269.8451250000003,120.8065,"4762","5960","E27","E29","E30",null,null,null,null,null,null,null,null,null,null,null,null,null,null,null,null,null,null,null,null,null,null,null,null,null,null,null,null,null,null,null,null,null,null,null,null,1,0.79314448749766608,7.7573508578603068E-2,0.32134446651327175,0.15488177336628664]
["4773",685.0905919999999,0,"4773",null,null,null,null,null,null,null,null,null,null,null,null,null,null,null,null,null,null,null,null,null,null,null,null,null,null,null,null,null,null,null,null,null,null,null,null,null,null,null,null,1]
["4775",180.25234900000001,0,"4775",null,null,null,null,null,null,null,null,null,null,null,null,null,null,null,null,null,null,null,null,null,null,null,null,null,null,null,null,null,null,null,null,null,null,null,null,null,null,null,null,1]
["4777",743.13537099999996,741.41959999999995,"4777","302","4762","4787","4798","5213","C99","E27","5960","E27","E29","E30","E19","E26",null,null,null,null,null,null,null,null,null,null,null,null,null,null,null,null,null,null,null,null,null,null,null,null,null,null,null,1,6.9300717481000515E-2,6.1006514792573283E-2,0.29250111196235024,0.11015135263633601,5.8828880018817434E-2,0.13781740226708433,4.6528378176184729E-3,4.8386980909174322E-2,4.7324893986123578E-3,1.9604105949853481E-2,9.4487971979703468E-3,9.6025272490214544E-2,4.3207101520676399E-3]
["4787",1428.8972960000001,65.768900000000002,"4787","E19",null,null,null,null,null,null,null,null,null,null,null,null,null,null,null,null,null,null,null,null,null,null,null,null,null,null,null,null,null,null,null,null,null,null,null,null,null,null,null,1,0.32829028185908093]
["4788",491.01055500000001,489.65559999999999,"4788","302","4762","4787","4798","5213","C99","E27","5960","E27","E29","E30","E19","E26",null,null,null,null,null,null,null,null,null,null,null,null,null,null,null,null,null,null,null,null,null,null,null,null,null,null,null,1,7.0997385991836498E-2,6.246709123455163E-2,0.11447787349727653,0.11251594775315196,6.341700452937786E-2,9.0814281310042225E-2,4.7667518389753862E-3,4.9545429062698404E-2,4.8457914377638715E-3,2.0073454107402869E-2,9.6750138674409764E-3,3.7581973357049124E-2,4.6576867551474154E-3]
["4798",542.019316,0,"4798",null,null,null,null,null,null,null,null,null,null,null,null,null,null,null,null,null,null,null,null,null,null,null,null,null,null,null,null,null,null,null,null,null,null,null,null,null,null,null,null,1]
["4804",69.588364999999996,4.0824999999999996,"4804","E03","E11","E27","E28","E29","E30",null,null,null,null,null,null,null,null,null,null,null,null,null,null,null,null,null,null,null,null,null,null,null,null,null,null,null,null,null,null,null,null,null,null,1,5.6812860499071756E-4,4.7238390083494701E-3,3.0003971712703015E-3,1.6277565240714987E-2,1.4313784699923018E-2,1.5096484759095378E-3]
["4825",53.179243999999997,1.6516999999999999,"4825","4762","5218","E03","E27","E28","E29","E30","5960","E27","E29","E30",null,null,null,null,null,null,null,null,null,null,null,null,null,null,null,null,null,null,null,null,null,null,null,null,null,null,null,null,null,1,2.7226434966861835E-5,2.7388116055972617E-4,2.2297670469461069E-4,1.2977922356098245E-3,6.3904926836521386E-3,6.5843408201948202E-3,6.1201965239575861E-4,2.1594496808180166E-5,2.1120500864666347E-6,8.7490642194845042E-6,4.2168785301094359E-6]
["4835",10.766314999999999,0,"4835",null,null,null,null,null,null,null,null,null,null,null,null,null,null,null,null,null,null,null,null,null,null,null,null,null,null,null,null,null,null,null,null,null,null,null,null,null,null,null,null,1]
["4841",12.392618000000002,0.58599999999999997,"4841","4762","E03","E27","E28","E29","E30","5960","E27","E29","E30",null,null,null,null,null,null,null,null,null,null,null,null,null,null,null,null,null,null,null,null,null,null,null,null,null,null,null,null,null,null,1,2.2688702414098654E-5,1.0401112839071431E-4,5.1137937956007712E-4,1.8163329922244672E-3,2.8627569399846038E-3,2.4480786095830345E-4,1.7995419248217336E-5,1.760042251357454E-6,7.2908889731369124E-6,3.5140664652755485E-6]
["4853",176.92905099999999,0,"4853",null,null,null,null,null,null,null,null,null,null,null,null,null,null,null,null,null,null,null,null,null,null,null,null,null,null,null,null,null,null,null,null,null,null,null,null,null,null,null,null,1]
["4855",697.73846900000001,122.0384,"4855","4762","8007","C99","E03","E09","E26","E30","5960","E27","E29","E30",null,null,null,null,null,null,null,null,null,null,null,null,null,null,null,null,null,null,null,null,null,null,null,null,null,null,null,null,null,1,6.289412035208922E-3,0.99855870096278199,0.11656586215818941,5.2904948316741765E-2,5.1821021694526764E-2,1.8945338037196967E-2,0.21889902900688299,4.988412485327433E-3,4.8789175846764867E-4,2.021067755136362E-3,9.7411528944442384E-4]
["5014",1081.3879400000003,0,"5014",null,null,null,null,null,null,null,null,null,null,null,null,null,null,null,null,null,null,null,null,null,null,null,null,null,null,null,null,null,null,null,null,null,null,null,null,null,null,null,null,1]
["5025",81.709490999999986,0,"5025",null,null,null,null,null,null,null,null,null,null,null,null,null,null,null,null,null,null,null,null,null,null,null,null,null,null,null,null,null,null,null,null,null,null,null,null,null,null,null,null,1]
["5026",168.93380400000001,0,"5026",null,null,null,null,null,null,null,null,null,null,null,null,null,null,null,null,null,null,null,null,null,null,null,null,null,null,null,null,null,null,null,null,null,null,null,null,null,null,null,null,1]
["5027",105.35161200000002,0,"5027",null,null,null,null,null,null,null,null,null,null,null,null,null,null,null,null,null,null,null,null,null,null,null,null,null,null,null,null,null,null,null,null,null,null,null,null,null,null,null,null,1]
["5044",49.468948000000005,49.431100000000001,"5044","E06",null,null,null,null,null,null,null,null,null,null,null,null,null,null,null,null,null,null,null,null,null,null,null,null,null,null,null,null,null,null,null,null,null,null,null,null,null,null,null,1,0.46067887866319357]
["5056",28.170407000000001,28.160900000000002,"5056","E08",null,null,null,null,null,null,null,null,null,null,null,null,null,null,null,null,null,null,null,null,null,null,null,null,null,null,null,null,null,null,null,null,null,null,null,null,null,null,null,1,9.1260406154045584E-2]
["5068",2.9342239999999999,2.9283999999999999,"5068","E07",null,null,null,null,null,null,null,null,null,null,null,null,null,null,null,null,null,null,null,null,null,null,null,null,null,null,null,null,null,null,null,null,null,null,null,null,null,null,null,1,0.14594221503468624]
["5080",23.953295000000001,23.759499999999999,"5080","E10",null,null,null,null,null,null,null,null,null,null,null,null,null,null,null,null,null,null,null,null,null,null,null,null,null,null,null,null,null,null,null,null,null,null,null,null,null,null,null,1,0.32835134348902228]
["5092",6.480302,3.2471000000000001,"5092","E09",null,null,null,null,null,null,null,null,null,null,null,null,null,null,null,null,null,null,null,null,null,null,null,null,null,null,null,null,null,null,null,null,null,null,null,null,null,null,null,1,5.0016909839247309E-2]
["5093",159.36832200000003,0,"5093",null,null,null,null,null,null,null,null,null,null,null,null,null,null,null,null,null,null,null,null,null,null,null,null,null,null,null,null,null,null,null,null,null,null,null,null,null,null,null,null,1]
["5213",139.44524799999999,31.063199999999998,"5213","E26",null,null,null,null,null,null,null,null,null,null,null,null,null,null,null,null,null,null,null,null,null,null,null,null,null,null,null,null,null,null,null,null,null,null,null,null,null,null,null,1,7.3445391968801482E-2]
["5218",898.23209299999996,0,"5218",null,null,null,null,null,null,null,null,null,null,null,null,null,null,null,null,null,null,null,null,null,null,null,null,null,null,null,null,null,null,null,null,null,null,null,null,null,null,null,null,1]
["5253",27.747121,0,"5253",null,null,null,null,null,null,null,null,null,null,null,null,null,null,null,null,null,null,null,null,null,null,null,null,null,null,null,null,null,null,null,null,null,null,null,null,null,null,null,null,1]
["5256",24.810597999999999,0,"5256",null,null,null,null,null,null,null,null,null,null,null,null,null,null,null,null,null,null,null,null,null,null,null,null,null,null,null,null,null,null,null,null,null,null,null,null,null,null,null,null,1]
["5279",11.358993,0,"5279",null,null,null,null,null,null,null,null,null,null,null,null,null,null,null,null,null,null,null,null,null,null,null,null,null,null,null,null,null,null,null,null,null,null,null,null,null,null,null,null,1]
["5299",33.132173999999999,0,"5299",null,null,null,null,null,null,null,null,null,null,null,null,null,null,null,null,null,null,null,null,null,null,null,null,null,null,null,null,null,null,null,null,null,null,null,null,null,null,null,null,1]
["5401",37.216894000000003,37.1,"5401","E04","E07","E09","E10","E11","E12","E14","E15","E18","E19","E21","E23","E25","E26","E27","E28","E30","E27","E19","E21","E03","E11",null,null,null,null,null,null,null,null,null,null,null,null,null,null,null,null,null,null,1,4.3611378923441864E-2,7.7494311159397172E-2,1.3684451228904675E-2,7.5805658090577549E-3,1.3708974455480858E-2,0.11715037562296515,1.139584369096152E-2,1.0430856994612735E-2,0.1562053309572001,3.5625786858888765E-2,2.2988659435002032E-2,1.0793787467701032E-2,9.3150861999321391E-2,5.162604615136173E-4,9.1935742652685132E-3,5.476771652395488E-2,7.2218318982699512E-3,1.2476213328132553E-4,1.3802477257196949E-5,5.5510571859661901E-5,1.254525246786434E-6,1.77179973943826E-5]
["5421",12.589682,12.5488,"5421","E04","E07","E09","E10","E11","E12","E15","E18","E19","E21","E23","E25","E26","E27","E28","E30","E27","E19","E21","E03","E11",null,null,null,null,null,null,null,null,null,null,null,null,null,null,null,null,null,null,null,1,2.7230713691314714E-2,9.1011930866757036E-3,1.7952282515603915E-3,2.1446418675485522E-3,7.1192190388333475E-3,5.0794972025835277E-3,1.9406503907974916E-2,4.1933132896266434E-2,5.118811886130269E-3,3.7018775257652223E-3,5.0154215232307226E-3,1.5220185487389119E-2,2.297122237010132E-4,2.1629870593497073E-3,1.2692112804993601E-2,3.296745860905153E-3,7.7900814300445835E-5,5.9845855588457014E-7,2.4068705966632033E-6,2.3340315294312037E-6,3.2964154896684127E-5]
["5441",29.491413000000001,29.393899999999999,"5441","E04","E07","E09","E10","E11","E12","E15","E18","E19","E21","E23","E25","E26","E27","E28","E30","E27","E19","E21","E03","E11",null,null,null,null,null,null,null,null,null,null,null,null,null,null,null,null,null,null,null,1,4.8147988403524064E-2,2.8846533370544613E-2,9.4906499731976166E-3,7.3196899949005047E-3,1.4961775925820207E-2,7.6979422394082758E-2,7.8070354588006707E-2,9.3217413240648403E-2,1.5854018489780009E-2,1.602912968656341E-2,1.046859804225465E-2,4.0753502124703106E-2,5.4704663582406238E-4,8.4936808915927527E-3,3.8076338414980808E-2,5.1409650801243724E-3,1.3774033049891241E-4,9.069597269461935E-6,3.6475954394501504E-5,9.3895670228062389E-6,1.3261137985912769E-4]
["5461",51.620234000000004,31.676200000000001,"5461","E04","E07","E09","E10","E11","E12","E14","E15","E18","E27","E19","E21","E03","E11",null,null,null,null,null,null,null,null,null,null,null,null,null,null,null,null,null,null,null,null,null,null,null,null,null,null,1,2.0947128101427532E-2,0.18699932969858862,3.7303732616960052E-2,2.2159277004868704E-2,1.3377321591769655E-2,0.39344640655786073,0.11452746014384674,8.1980537401748661E-3,0.34419868201318282,5.9924919884763134E-5,4.6355251099819634E-5,1.864307724837928E-4,9.8598469875227721E-7,1.3925327025616996E-5]
["5481",43.092446000000002,0,"5481",null,null,null,null,null,null,null,null,null,null,null,null,null,null,null,null,null,null,null,null,null,null,null,null,null,null,null,null,null,null,null,null,null,null,null,null,null,null,null,null,1]
["5501",222.35908999999998,0,"5501",null,null,null,null,null,null,null,null,null,null,null,null,null,null,null,null,null,null,null,null,null,null,null,null,null,null,null,null,null,null,null,null,null,null,null,null,null,null,null,null,1]
["5515",67.36574499999999,0,"5515",null,null,null,null,null,null,null,null,null,null,null,null,null,null,null,null,null,null,null,null,null,null,null,null,null,null,null,null,null,null,null,null,null,null,null,null,null,null,null,null,1]
["5517",98.302221000000003,0,"5517",null,null,null,null,null,null,null,null,null,null,null,null,null,null,null,null,null,null,null,null,null,null,null,null,null,null,null,null,null,null,null,null,null,null,null,null,null,null,null,null,1]
["5519",15.381981000000001,0,"5519",null,null,null,null,null,null,null,null,null,null,null,null,null,null,null,null,null,null,null,null,null,null,null,null,null,null,null,null,null,null,null,null,null,null,null,null,null,null,null,null,1]
["5546",249.60796200000001,0,"5546",null,null,null,null,null,null,null,null,null,null,null,null,null,null,null,null,null,null,null,null,null,null,null,null,null,null,null,null,null,null,null,null,null,null,null,null,null,null,null,null,1]
["5782",18.498710000000003,0,"5782",null,null,null,null,null,null,null,null,null,null,null,null,null,null,null,null,null,null,null,null,null,null,null,null,null,null,null,null,null,null,null,null,null,null,null,null,null,null,null,null,1]
["5937",121.614823,0,"5937",null,null,null,null,null,null,null,null,null,null,null,null,null,null,null,null,null,null,null,null,null,null,null,null,null,null,null,null,null,null,null,null,null,null,null,null,null,null,null,null,1]
["5960",47.667135000000002,0,"5960",null,null,null,null,null,null,null,null,null,null,null,null,null,null,null,null,null,null,null,null,null,null,null,null,null,null,null,null,null,null,null,null,null,null,null,null,null,null,null,null,1]
["5968",24.504280000000001,0,"5968",null,null,null,null,null,null,null,null,null,null,null,null,null,null,null,null,null,null,null,null,null,null,null,null,null,null,null,null,null,null,null,null,null,null,null,null,null,null,null,null,1]
["5976",115.43846799999999,0,"5976",null,null,null,null,null,null,null,null,null,null,null,null,null,null,null,null,null,null,null,null,null,null,null,null,null,null,null,null,null,null,null,null,null,null,null,null,null,null,null,null,1]
["5986",25.657177999999998,0,"5986",null,null,null,null,null,null,null,null,null,null,null,null,null,null,null,null,null,null,null,null,null,null,null,null,null,null,null,null,null,null,null,null,null,null,null,null,null,null,null,null,1]
["5985",60.570655000000002,0,"5985",null,null,null,null,null,null,null,null,null,null,null,null,null,null,null,null,null,null,null,null,null,null,null,null,null,null,null,null,null,null,null,null,null,null,null,null,null,null,null,null,1]
["5988",42.105397999999994,0,"5988",null,null,null,null,null,null,null,null,null,null,null,null,null,null,null,null,null,null,null,null,null,null,null,null,null,null,null,null,null,null,null,null,null,null,null,null,null,null,null,null,1]
["6100",4.2977980000000002,0,"6100",null,null,null,null,null,null,null,null,null,null,null,null,null,null,null,null,null,null,null,null,null,null,null,null,null,null,null,null,null,null,null,null,null,null,null,null,null,null,null,null,1]
["6101",13.096633000000001,0,"6101",null,null,null,null,null,null,null,null,null,null,null,null,null,null,null,null,null,null,null,null,null,null,null,null,null,null,null,null,null,null,null,null,null,null,null,null,null,null,null,null,1]
["6103",7.3304800000000006,0,"6103",null,null,null,null,null,null,null,null,null,null,null,null,null,null,null,null,null,null,null,null,null,null,null,null,null,null,null,null,null,null,null,null,null,null,null,null,null,null,null,null,1]
["6106",4.2780240000000003,0,"6106",null,null,null,null,null,null,null,null,null,null,null,null,null,null,null,null,null,null,null,null,null,null,null,null,null,null,null,null,null,null,null,null,null,null,null,null,null,null,null,null,1]
["6107",10.153003999999999,0,"6107",null,null,null,null,null,null,null,null,null,null,null,null,null,null,null,null,null,null,null,null,null,null,null,null,null,null,null,null,null,null,null,null,null,null,null,null,null,null,null,null,1]
["8003",159.910561,0,"8003",null,null,null,null,null,null,null,null,null,null,null,null,null,null,null,null,null,null,null,null,null,null,null,null,null,null,null,null,null,null,null,null,null,null,null,null,null,null,null,null,1]
["8005",129.85163799999998,0,"8005",null,null,null,null,null,null,null,null,null,null,null,null,null,null,null,null,null,null,null,null,null,null,null,null,null,null,null,null,null,null,null,null,null,null,null,null,null,null,null,null,1]
["8006",23.131305999999999,0,"8006",null,null,null,null,null,null,null,null,null,null,null,null,null,null,null,null,null,null,null,null,null,null,null,null,null,null,null,null,null,null,null,null,null,null,null,null,null,null,null,null,1]
["8007",0.695886,0,"8007",null,null,null,null,null,null,null,null,null,null,null,null,null,null,null,null,null,null,null,null,null,null,null,null,null,null,null,null,null,null,null,null,null,null,null,null,null,null,null,null,1]
["611",4374.6923310000002,0,"611",null,null,null,null,null,null,null,null,null,null,null,null,null,null,null,null,null,null,null,null,null,null,null,null,null,null,null,null,null,null,null,null,null,null,null,null,null,null,null,null,1]
["612",774.6007330000001,0,"612",null,null,null,null,null,null,null,null,null,null,null,null,null,null,null,null,null,null,null,null,null,null,null,null,null,null,null,null,null,null,null,null,null,null,null,null,null,null,null,null,1]
["613",863.52153500000009,0,"613",null,null,null,null,null,null,null,null,null,null,null,null,null,null,null,null,null,null,null,null,null,null,null,null,null,null,null,null,null,null,null,null,null,null,null,null,null,null,null,null,1]
["618",363.44455700000003,0,"618",null,null,null,null,null,null,null,null,null,null,null,null,null,null,null,null,null,null,null,null,null,null,null,null,null,null,null,null,null,null,null,null,null,null,null,null,null,null,null,null,1]
["650",3134.8573509999997,0,"650",null,null,null,null,null,null,null,null,null,null,null,null,null,null,null,null,null,null,null,null,null,null,null,null,null,null,null,null,null,null,null,null,null,null,null,null,null,null,null,null,1]
["653",488.15343400000006,0,"653",null,null,null,null,null,null,null,null,null,null,null,null,null,null,null,null,null,null,null,null,null,null,null,null,null,null,null,null,null,null,null,null,null,null,null,null,null,null,null,null,1]
["6562",11.578678999999999,3.5291999999999999,"6562","C35","C76","E05","E10",null,null,null,null,null,null,null,null,null,null,null,null,null,null,null,null,null,null,null,null,null,null,null,null,null,null,null,null,null,null,null,null,null,null,null,null,1,1.0844479124027834E-3,1.2598531317849045E-4,6.4640222864406861E-3,6.9890450676546876E-3]
["6570",191.56838499999998,177.34209999999999,"6570","2421","296","3072","4345","4804","5093","5501","5546","650","C35","5218","5519","5968","5218","5093","5960","E27","E03","E11","E27","E28","E29","E30",null,null,null,null,null,null,null,null,null,null,null,null,null,null,null,null,null,1,5.4187033287797356E-3,1.9673815219978207E-2,1.4096975181993977E-2,0.15294066326759789,0.21919561694190409,7.2115200639022936E-2,7.80984565057153E-3,2.2896522427165795E-2,9.3409950608917634E-3,8.7842884662189813E-3,1.1006381548759427E-4,8.2216317176777298E-3,1.3824752533216913E-2,4.8525365454813927E-5,1.0842150075821497E-2,3.8917556254002132E-3,2.3785950618603045E-3,1.2453130007328365E-4,1.0354448057693945E-3,6.5767390902733756E-4,3.5679709552506153E-3,3.1375188680732137E-3,3.3090832904239639E-4]
["6573",27.607519,26.0045,"6573","2421","4345","4804","5093","5546","650","5218","5093","5960","E27","E03","E11","E27","E28","E29","E30",null,null,null,null,null,null,null,null,null,null,null,null,null,null,null,null,null,null,null,null,null,null,null,null,1,2.1396951389022994E-3,1.2593213892124484E-2,0.13757982249915218,2.6053215162613892E-2,3.8520070670811832E-3,5.9719667631452709E-4,4.3461137596709718E-5,8.927482857612318E-4,3.2044918571323341E-4,1.9585475658849189E-4,7.8163032631313874E-5,6.4990493228329112E-4,4.1279411025032636E-4,2.2394645365359372E-3,1.9692879583064894E-3,2.0769716935174984E-4]
["6580",22.286718,22.163900000000002,"6580","296","299","5501","C19","C35","C76","E10","5519","5968",null,null,null,null,null,null,null,null,null,null,null,null,null,null,null,null,null,null,null,null,null,null,null,null,null,null,null,null,null,null,null,1,1.0390331914404166E-2,2.7544647436633519E-2,1.916891190870983E-4,8.9277835361889595E-3,8.5131626765939088E-3,8.8652627563174464E-4,4.4021276919186128E-2,4.3420903098610629E-3,7.3012664726441728E-3]
["6586",4.5456139999999996,4.5456000000000003,"6586","302","4804","E27","E03","E11","E27","E28","E29","E30",null,null,null,null,null,null,null,null,null,null,null,null,null,null,null,null,null,null,null,null,null,null,null,null,null,null,null,null,null,null,null,1,7.7088352685568179E-4,4.9006754142931867E-2,5.1756982569719832E-5,2.7842138866346951E-5,2.3150001689297355E-4,1.4703972650359192E-4,7.9771063779725292E-4,7.0147212764398714E-4,7.3982971701150516E-5]
["6592",103.55022699999999,95.947500000000005,"6592","2421","296","4345","4804","5093","5501","5546","650","C35","5218","5519","5968","5093","5960","E27","E03","E11","E27","E28","E29","E30",null,null,null,null,null,null,null,null,null,null,null,null,null,null,null,null,null,null,null,1,1.1733334120986859E-2,1.2657664511795032E-2,2.0903133462675163E-2,0.30579721663380682,6.3997749489704034E-2,5.818973903024432E-3,1.158401802025576E-2,4.7735799944201608E-3,1.0273446678872896E-2,2.3832556303417555E-4,5.2896021873897175E-3,8.8945167761030775E-3,1.4818486151110175E-3,5.3190489372679692E-4,3.2509398723301971E-4,1.7373214609620892E-4,1.4445368205794702E-3,9.1751310377040547E-4,4.9776341441858446E-3,4.3771155207320287E-3,4.6164630202860527E-4]
["6602",5.9778190000000002,5.9691000000000001,"6602","5044","C19","C76","E06",null,null,null,null,null,null,null,null,null,null,null,null,null,null,null,null,null,null,null,null,null,null,null,null,null,null,null,null,null,null,null,null,null,null,null,null,1,1.8102204011004895E-2,6.2192452889959461E-3,3.946261767777337E-4,8.3393030451221015E-3]
["724",3125.6356799999994,45.8157,"724","4710","4762","5093","5960","E27","4762","E03","E11","E27","E28","E29","E30","5960","E27","E29","E30","5960","E27","E29","E30",null,null,null,null,null,null,null,null,null,null,null,null,null,null,null,null,null,null,null,null,1,1.9851780228660826E-2,1.489740092837172E-3,0.15923535433332728,9.0355503061860271E-2,2.8743811934873745E-2,1.4647368793726212E-5,3.314472342147767E-5,5.4546730377392908E-4,1.8635588383007117E-4,9.4989861170928329E-4,9.0076852268726958E-4,9.9627373006852334E-5,1.1815791424380643E-3,1.1556436587159328E-4,4.78719735376193E-4,2.3073358743347768E-4,1.1617479815089283E-5,1.136247788774083E-6,4.706850910843094E-6,2.2686104539223226E-6]
["734",158.92351399999998,5.9036999999999997,"734","5968",null,null,null,null,null,null,null,null,null,null,null,null,null,null,null,null,null,null,null,null,null,null,null,null,null,null,null,null,null,null,null,null,null,null,null,null,null,null,null,1,0.24092506213195233]
["736",1742.4114500000001,0,"736",null,null,null,null,null,null,null,null,null,null,null,null,null,null,null,null,null,null,null,null,null,null,null,null,null,null,null,null,null,null,null,null,null,null,null,null,null,null,null,null,1]
["738",531.36908200000005,0,"738",null,null,null,null,null,null,null,null,null,null,null,null,null,null,null,null,null,null,null,null,null,null,null,null,null,null,null,null,null,null,null,null,null,null,null,null,null,null,null,null,1]
["740",659.89088900000013,31.660599999999999,"740","4710","4762","5093","E27","4762","E03","E11","E27","E28","E29","E30","5960","E27","E29","E30","5960","E27","E29","E30",null,null,null,null,null,null,null,null,null,null,null,null,null,null,null,null,null,null,null,null,null,1,2.7324852136213176E-2,1.8246253015238791E-3,0.11002350699605881,1.408614548195368E-2,2.0161274296967741E-5,4.562183623612756E-5,7.5080487740050641E-4,2.5650832881064616E-4,1.3074816873036321E-3,1.2398568998789089E-3,1.3713144135059965E-4,1.4471914996524316E-3,1.4154258648049883E-4,5.863332441048085E-4,2.8260120242901387E-4,1.5990803569568346E-5,1.5639807846313963E-6,6.4787139331868368E-6,3.1226139164384976E-6,null,null,null,null,null,null,null,null,null,null,null,null,null,null,null,null,null,null,null,null,null,8.8074428482716956E-5]
["756",449.28328199999999,0,"756",null,null,null,null,null,null,null,null,null,null,null,null,null,null,null,null,null,null,null,null,null,null,null,null,null,null,null,null,null,null,null,null,null,null,null,null,null,null,null,null,1]
["C11",82.471224000000007,82.499399999999994,"C11","2891","2421","2979","307","3864","3914","3997","3999","4773","4775","4798","5014","5213","5515","5517","5546","5976","5985","5986","E27","E30","5218","4710","E27","E26","4762","E03","E11","E27","E28","E29","E30",null,null,null,null,null,null,null,null,1,9.8403289247527559E-2,1.143534367216784E-3,2.2464230532044114E-3,2.5521229241279105E-3,4.0138368165185982E-3,1.0512701567189586E-2,4.0868114604954682E-3,1.9632213080902523E-2,2.0228812512270395E-2,2.3836113489480035E-2,4.1892710088286956E-5,1.3338076645089861E-2,3.2295920055459603E-3,2.5085639010529275E-2,1.8666464383211144E-2,6.6246046508322675E-3,9.9597725154211766E-3,8.073307021862321E-3,1.518077429114003E-2,4.617179992163929E-3,2.0516563770409425E-3,2.3227282979047018E-5,1.1519817708196498E-4,2.2693720876053536E-4,2.3719865074663072E-4,8.4997424142768984E-8,1.9233598569299236E-7,3.1652999544016186E-6,1.0814072016941135E-6,5.5121801279874684E-6,5.2270824375022838E-6,5.7812909601349991E-7]
["C12",443.63465100000002,443.48809999999997,"C12","2898","2421","2979","307","3864","3914","3997","3999","4324","4773","4775","4798","5014","5213","5515","5517","5546","5976","5985","5986","E27","E30","5218","4710","E27","E26","4762","E03","E11","E27","E28","E29","E30",null,null,null,null,null,null,null,1,0.19778494791783965,4.687291980281191E-3,3.056785223134809E-2,1.4614895963660781E-2,3.2462266797782247E-2,4.9176946253361206E-2,4.4613961902567154E-2,8.1841394027654557E-2,1.8663308227740482E-9,7.9697779365595217E-2,6.2240540141510495E-2,8.8158657070247001E-3,6.4625987440135993E-2,2.5995895391199082E-2,6.1861349748305976E-2,6.3253203256472254E-2,3.7617101442146958E-2,5.6550996403322992E-2,5.1537777888863351E-2,6.568091172627194E-2,5.4656252452816537E-2,1.205640819734943E-2,9.5207507839394437E-5,9.3167563356410903E-4,1.8353751170976063E-3,1.9092787265865762E-3,6.8742432385181647E-7,1.5555346088523319E-6,2.5599648493910616E-5,8.7459781508720369E-6,4.4580253291753013E-5,4.2274500039933263E-5,4.6756711386759341E-6]
["C13",480.93922800000001,481.71499999999997,"C13","2905","2421","2979","307","3864","3914","3997","3999","4773","4775","4798","5014","5213","5515","5517","5546","5976","5985","5986","E27","E30","5218","4710","E27","E26","4762","E03","E11","E27","E28","E29","E30",null,null,null,null,null,null,null,null,1,0.21106134458240292,2.5488186012522611E-3,3.556611754784466E-2,2.9542775798962265E-2,5.6762493864369601E-2,7.339230202398947E-2,4.8738471883349746E-2,1.925061480819204E-2,3.9567013501396506E-2,2.5169188891263523E-2,2.0002398903130676E-2,4.1706676767391669E-2,3.7387963882189894E-2,3.360601722169184E-2,5.6085415226529316E-2,3.7190192791248439E-2,6.0020628285797926E-2,4.9328496626252563E-2,5.4056663172154233E-2,1.6160170366197001E-3,3.8631545112288626E-2,5.1771186429346654E-5,1.6290985704479006E-3,3.2092789290422232E-3,2.7459736622428297E-3,1.2020084490071076E-6,2.7199586597208075E-6,4.4762736367655412E-5,1.5292941008072196E-5,7.7951622100464377E-5,7.3919854829729281E-5,8.1757307945924013E-6]
["C14",530.57795800000008,531.26340000000005,"C14","2912","2421","2979","302","307","3864","3914","3997","3999","4773","4775","4798","5014","5213","5515","5517","5546","5976","5985","5986","E27","E30","5218","E27","4710","E27","E26","4762","E03","E11","E27","E28","E29","E30",null,null,null,null,null,null,1,0.3107014029898284,2.8422698047877813E-3,4.7006219889231961E-2,1.7531346185519592E-9,4.8762143554928243E-2,7.8161845556983342E-2,5.0113461549175502E-2,7.4726969511650781E-2,5.1287269367754143E-2,1.5862072806204473E-2,5.4940284407829575E-2,2.8504310675162122E-2,5.3998746301621686E-2,2.9124702959814345E-2,3.0844030342443953E-2,2.1138268907507259E-2,3.3736024582623939E-2,5.3261124032972472E-2,6.1971678688636886E-2,4.0693525665747944E-2,1.7195561693866202E-2,1.5301168342709875E-2,5.7731719265496474E-5,1.1770514576289964E-10,2.2432656176930165E-3,4.4191709511645673E-3,2.1390752248584772E-3,1.6551633367972355E-6,3.7453778755821446E-6,6.1638202420010951E-5,2.105835053761289E-5,1.0733923463777486E-4,1.0178749881218059E-4,1.1257965677289061E-5]
["C17",31.015265999999997,1.5096000000000001,"C17","5519","5968",null,null,null,null,null,null,null,null,null,null,null,null,null,null,null,null,null,null,null,null,null,null,null,null,null,null,null,null,null,null,null,null,null,null,null,null,null,null,1,2.6685825640358863E-2,4.4852215733565119E-2]
["C19",574.52193799999998,0,"C19",null,null,null,null,null,null,null,null,null,null,null,null,null,null,null,null,null,null,null,null,null,null,null,null,null,null,null,null,null,null,null,null,null,null,null,null,null,null,null,null,1]
["C24",220.10850499999998,0,"C24",null,null,null,null,null,null,null,null,null,null,null,null,null,null,null,null,null,null,null,null,null,null,null,null,null,null,null,null,null,null,null,null,null,null,null,null,null,null,null,null,1]
["C30",30.035287999999998,0,"C30",null,null,null,null,null,null,null,null,null,null,null,null,null,null,null,null,null,null,null,null,null,null,null,null,null,null,null,null,null,null,null,null,null,null,null,null,null,null,null,null,1]
["C35",289.25121700000005,0,"C35",null,null,null,null,null,null,null,null,null,null,null,null,null,null,null,null,null,null,null,null,null,null,null,null,null,null,null,null,null,null,null,null,null,null,null,null,null,null,null,null,1]
["C36",238.71424199999998,216.4657,"C36","2421","307","3864","3914","3997","3999","4773","4775","4798","5014","5515","5517","5546","5976","5985","5986","5218","4710","E27","4762","E03","E11","E27","E28","E29","E30","5960","E27","E29","E30",null,null,null,null,null,null,null,null,null,null,1,3.7709439131914648E-3,2.7549383258243439E-4,3.8531816437978423E-5,1.725773643674116E-2,3.4446430188320763E-8,4.9507987621576356E-8,0.11063205122067067,6.1254050572447623E-3,1.3961822023680708E-4,7.3584064339909855E-2,5.3365507669333206E-2,0.10305004140293909,2.2876150844524216E-2,2.8862442685932337E-2,2.7480083439682883E-2,7.4785003819590606E-2,7.6594795819729444E-5,1.1058733118009507E-6,2.1785397041857099E-6,8.1595373566054265E-10,1.8463767297764746E-9,3.0386077558561729E-8,1.0381235136142566E-8,5.2915532587322705E-8,5.0178666994915577E-8,5.5498928390337463E-9,6.4716920749228725E-10,6.3296394113006329E-11,2.6220221788534828E-10,1.2637636156395113E-10]
["C42",286.94011700000004,0,"C42",null,null,null,null,null,null,null,null,null,null,null,null,null,null,null,null,null,null,null,null,null,null,null,null,null,null,null,null,null,null,null,null,null,null,null,null,null,null,null,null,1]
["C44",26.168562999999999,2.4611000000000001,"C44","5988",null,null,null,null,null,null,null,null,null,null,null,null,null,null,null,null,null,null,null,null,null,null,null,null,null,null,null,null,null,null,null,null,null,null,null,null,null,null,null,1,5.8451148783766456E-2]
["C50",26.207042999999999,26.153700000000001,"C50","E05",null,null,null,null,null,null,null,null,null,null,null,null,null,null,null,null,null,null,null,null,null,null,null,null,null,null,null,null,null,null,null,null,null,null,null,null,null,null,null,1,7.5784418326274167E-2]
["C513",137.60397800000001,137.57249999999999,"C513","650",null,null,null,null,null,null,null,null,null,null,null,null,null,null,null,null,null,null,null,null,null,null,null,null,null,null,null,null,null,null,null,null,null,null,null,null,null,null,null,1,4.388478500808362E-2]
["C515",334.507498,334.4443,"C515","724","4710","4762","5093","5960","E27","4762","E03","E11","E27","E28","E29","E30","5960","E27","E29","E30","5960","E27","E29","E30",null,null,null,null,null,null,null,null,null,null,null,null,null,null,null,null,null,null,null,1,0.10700042240367295,2.1241488699315918E-3,1.5940281920526436E-4,1.7038250175264551E-2,9.6680769941154127E-3,3.0756000185232267E-3,1.5672746480310822E-6,3.5464994065510233E-6,5.8365231911203004E-5,1.9940158287227423E-5,1.0163955269355585E-4,9.6382612415470319E-5,1.0660170994701486E-5,1.2642946734424252E-4,1.2365435963073087E-5,5.1223213898227188E-5,2.468859131809692E-5,1.2430752474806977E-6,1.2157899335406624E-7,5.0363503565132383E-7,2.4274227683907673E-7]
["C516",7.1089599999999997,7.1075999999999997,"C516","612",null,null,null,null,null,null,null,null,null,null,null,null,null,null,null,null,null,null,null,null,null,null,null,null,null,null,null,null,null,null,null,null,null,null,null,null,null,null,null,1,9.1757708584564932E-3]
["C517",99.837941999999998,99.497299999999996,"C517","086","4762","E03","E11","E27","E28","E29","E30","5960","E27","E29","E30",null,null,null,null,null,null,null,null,null,null,null,null,null,null,null,null,null,null,null,null,null,null,null,null,null,null,null,null,1,5.8628978780809908E-2,2.8493212593436233E-5,1.4497020340614595E-4,2.9887937066242149E-3,1.056884120635492E-3,4.1547284735561135E-3,5.3205443536804642E-3,4.9278066440216106E-4,2.2599234499583022E-5,2.2103184715488867E-6,9.1561362000870025E-6,4.4130792953740151E-6]
["C51",197.867468,197.97890000000001,"C51","2238","4710","4762","5093","5218","5960","618","E03","E11","E27","4762","E03","E11","E27","E28","E29","E30","5960","E27","E29","E30","5960","E27","E29","E30",null,null,null,null,null,null,null,null,null,null,null,null,null,null,null,1,8.8642449823804328E-2,5.0962514564784301E-3,5.566951799314735E-5,3.3796535619678102E-3,5.7243782217170731E-4,1.3763054571492113E-3,1.2370056048458462E-2,1.9102402683008144E-3,6.4414901635495861E-2,5.9319844478217905E-3,3.7602005305717346E-6,8.5087505032627999E-6,1.4002968546397072E-4,4.7840366629748448E-5,2.4385330321364515E-4,2.312408682153033E-4,2.5575849568305522E-5,4.4153971317916956E-5,4.3184798316081134E-6,1.788909156055892E-5,8.6221936692250643E-6,2.9823823227087705E-6,2.9169194811557422E-7,1.2083196334794955E-6,5.8238652638780214E-7]
["C55",664.26627600000006,0,"C55",null,null,null,null,null,null,null,null,null,null,null,null,null,null,null,null,null,null,null,null,null,null,null,null,null,null,null,null,null,null,null,null,null,null,null,null,null,null,null,null,1]
["C57",22.740079000000001,22.747900000000001,"C57","2947","5519",null,null,null,null,null,null,null,null,null,null,null,null,null,null,null,null,null,null,null,null,null,null,null,null,null,null,null,null,null,null,null,null,null,null,null,null,null,null,1,0.17033186934390412,2.0337487556629001E-2]
["C58",101.17384399999999,101.3146,"C58","2946","E19",null,null,null,null,null,null,null,null,null,null,null,null,null,null,null,null,null,null,null,null,null,null,null,null,null,null,null,null,null,null,null,null,null,null,null,null,null,null,1,0.13956093800128136,2.0578472846140672E-2]
["C62",662.50955999999996,663.34699999999998,"C62","4444","2421","2979","307","3864","3914","3997","3999","4773","4775","4798","5014","5213","5515","5517","5546","5976","5985","5986","E27","E30","5218","4710","E27","E26","4762","E03","E11","E27","E28","E29","E30",null,null,null,null,null,null,null,null,1,0.47913683628845133,3.0155063855772644E-3,6.9308944467112082E-2,3.1723987092626395E-2,9.8510772855488024E-2,5.5680045622574913E-2,0.12517418685411674,6.2443180656949308E-2,2.0281769145409544E-2,6.6788887594098137E-2,2.8965665997918395E-2,4.4424639554434923E-2,0.12435383331453788,2.8116903651999578E-2,2.5725618721441221E-2,3.108525919947052E-2,5.1687983057508782E-2,7.8771793610097382E-2,2.4803220157661766E-2,5.3587745519154155E-3,3.3585887524790609E-2,6.125047235213375E-5,2.8272852073071204E-3,5.5696733192202464E-3,9.1332160306092387E-3,2.0860743288244471E-6,4.7204626058945233E-6,7.7685306872539518E-5,2.6540754913593314E-5,1.3528430510478183E-4,1.2828721102426817E-4,1.4188903700358148E-5]
["C655",5.2102180000000002,5.2091000000000003,"C655","6562","C35","C76","E05","E10",null,null,null,null,null,null,null,null,null,null,null,null,null,null,null,null,null,null,null,null,null,null,null,null,null,null,null,null,null,null,null,null,null,null,null,1,0.44988651575738214,4.8787849283125499E-4,5.6679093582473677E-5,2.9080764642248676E-3,3.1442771339584845E-3]
["C656",111.54646099999999,111.3708,"C656","6570","2421","296","3072","4345","4804","5093","5501","5546","650","C35","5218","5519","5968","5218","5093","5960","E27","E03","E11","E27","E28","E29","E30",null,null,null,null,null,null,null,null,null,null,null,null,null,null,null,null,1,0.58136316036465308,3.1502344922978531E-3,1.1437631392716741E-2,8.1954620433860991E-3,8.891406734551692E-2,0.12743225660342525,4.1925120953833425E-2,4.5403565493764043E-3,1.3311194639617264E-2,5.4305104095506507E-3,5.106861704275838E-3,6.3987047613659864E-5,4.7797537987433955E-3,8.0372018239702279E-3,2.8210859818660382E-5,6.3032266332274491E-3,2.2625233497495846E-3,1.3828275423908643E-3,7.2397910174923146E-5,6.0196946466525955E-4,3.8234738224150831E-4,2.0742868706337876E-3,1.8240378848467722E-3,1.9237791196307407E-4]
["C657",9.1533350000000002,9.1521000000000008,"C657","6580","296","299","5501","C19","C35","C76","E10","5519","5968",null,null,null,null,null,null,null,null,null,null,null,null,null,null,null,null,null,null,null,null,null,null,null,null,null,null,null,null,null,null,1,0.41065512974105634,4.2668431003622803E-3,1.1311350766762393E-2,7.871812006866115E-5,3.6662401063537438E-3,3.4959739234633898E-3,3.6405656273840961E-4,1.8077563184615349E-2,1.7831016595433779E-3,2.9983025305977172E-3]
["C659",3.0944500000000001,3.0949,"C659","6602","5044","C19","C76","E06",null,null,null,null,null,null,null,null,null,null,null,null,null,null,null,null,null,null,null,null,null,null,null,null,null,null,null,null,null,null,null,null,null,null,null,1,0.51772510622637091,9.3719654945289468E-3,3.2198594278932831E-3,2.043078792919588E-4,4.3174665548897382E-3]
["C65",132.47998999999999,0,"C65",null,null,null,null,null,null,null,null,null,null,null,null,null,null,null,null,null,null,null,null,null,null,null,null,null,null,null,null,null,null,null,null,null,null,null,null,null,null,null,null,1]
["C75",368.55036900000005,0,"C75",null,null,null,null,null,null,null,null,null,null,null,null,null,null,null,null,null,null,null,null,null,null,null,null,null,null,null,null,null,null,null,null,null,null,null,null,null,null,null,null,1]
["C76",3802.3748440000004,0,"C76",null,null,null,null,null,null,null,null,null,null,null,null,null,null,null,null,null,null,null,null,null,null,null,null,null,null,null,null,null,null,null,null,null,null,null,null,null,null,null,null,1]
["C84",422.09666900000002,0,"C84",null,null,null,null,null,null,null,null,null,null,null,null,null,null,null,null,null,null,null,null,null,null,null,null,null,null,null,null,null,null,null,null,null,null,null,null,null,null,null,null,1]
["C85",728.67818399999999,0,"C85",null,null,null,null,null,null,null,null,null,null,null,null,null,null,null,null,null,null,null,null,null,null,null,null,null,null,null,null,null,null,null,null,null,null,null,null,null,null,null,null,1]
["C88",27.894457999999997,0,"C88",null,null,null,null,null,null,null,null,null,null,null,null,null,null,null,null,null,null,null,null,null,null,null,null,null,null,null,null,null,null,null,null,null,null,null,null,null,null,null,null,1]
["C96",141.80917099999999,0,"C96",null,null,null,null,null,null,null,null,null,null,null,null,null,null,null,null,null,null,null,null,null,null,null,null,null,null,null,null,null,null,null,null,null,null,null,null,null,null,null,null,1]
["C98",197.06506999999999,197.21870000000001,"C98","3072","5218",null,null,null,null,null,null,null,null,null,null,null,null,null,null,null,null,null,null,null,null,null,null,null,null,null,null,null,null,null,null,null,null,null,null,null,null,null,null,1,7.23813080855705E-2,2.4915482801133638E-4]
["C99",108.985787,0,"C99",null,null,null,null,null,null,null,null,null,null,null,null,null,null,null,null,null,null,null,null,null,null,null,null,null,null,null,null,null,null,null,null,null,null,null,null,null,null,null,null,1]
["E01",174.17758500000002,7.3792,"E01","E03","E27","E28","E29","E30",null,null,null,null,null,null,null,null,null,null,null,null,null,null,null,null,null,null,null,null,null,null,null,null,null,null,null,null,null,null,null,null,null,null,null,1,1.1748425522871123E-3,7.3520457705115909E-3,3.367159204545786E-2,3.5784461749807553E-2,3.5089126737356826E-3]
["E02",558.43625800000007,17.685300000000002,"E02","E27","E29","E30",null,null,null,null,null,null,null,null,null,null,null,null,null,null,null,null,null,null,null,null,null,null,null,null,null,null,null,null,null,null,null,null,null,null,null,null,null,1,1.7926414701634891E-2,7.8725815849576608E-2,2.8275307940684048E-2]
["E03",572.15820899999994,0,"E03",null,null,null,null,null,null,null,null,null,null,null,null,null,null,null,null,null,null,null,null,null,null,null,null,null,null,null,null,null,null,null,null,null,null,null,null,null,null,null,null,1]
["E04",189.74728800000003,0.84940000000000004,"E04","E27",null,null,null,null,null,null,null,null,null,null,null,null,null,null,null,null,null,null,null,null,null,null,null,null,null,null,null,null,null,null,null,null,null,null,null,null,null,null,null,1,2.8607702017480522E-3]
["E05",345.10666100000003,0,"E05",null,null,null,null,null,null,null,null,null,null,null,null,null,null,null,null,null,null,null,null,null,null,null,null,null,null,null,null,null,null,null,null,null,null,null,null,null,null,null,null,1]
["E06",107.30048000000001,0,"E06",null,null,null,null,null,null,null,null,null,null,null,null,null,null,null,null,null,null,null,null,null,null,null,null,null,null,null,null,null,null,null,null,null,null,null,null,null,null,null,null,1]
["E07",20.065623000000002,0,"E07",null,null,null,null,null,null,null,null,null,null,null,null,null,null,null,null,null,null,null,null,null,null,null,null,null,null,null,null,null,null,null,null,null,null,null,null,null,null,null,null,1]
["E08",308.57745699999998,0,"E08",null,null,null,null,null,null,null,null,null,null,null,null,null,null,null,null,null,null,null,null,null,null,null,null,null,null,null,null,null,null,null,null,null,null,null,null,null,null,null,null,1]
["E09",64.919630999999995,0,"E09",null,null,null,null,null,null,null,null,null,null,null,null,null,null,null,null,null,null,null,null,null,null,null,null,null,null,null,null,null,null,null,null,null,null,null,null,null,null,null,null,1]
["E10",72.360124999999996,0,"E10",null,null,null,null,null,null,null,null,null,null,null,null,null,null,null,null,null,null,null,null,null,null,null,null,null,null,null,null,null,null,null,null,null,null,null,null,null,null,null,null,1]
["E11",197.94066000000004,0,"E11",null,null,null,null,null,null,null,null,null,null,null,null,null,null,null,null,null,null,null,null,null,null,null,null,null,null,null,null,null,null,null,null,null,null,null,null,null,null,null,null,1]
["E12",9.4909339999999993,3.5900000000000001E-2,"E12","E19","E21",null,null,null,null,null,null,null,null,null,null,null,null,null,null,null,null,null,null,null,null,null,null,null,null,null,null,null,null,null,null,null,null,null,null,null,null,null,null,1,1.1781846352433915E-4,4.7384032329794842E-4]
["E13",3.844875,0.32200000000000001,"E13","E03","E26",null,null,null,null,null,null,null,null,null,null,null,null,null,null,null,null,null,null,null,null,null,null,null,null,null,null,null,null,null,null,null,null,null,null,null,null,null,null,1,4.9377951762292311E-4,9.3305789833195052E-5]
["E14",15.085485000000002,0,"E14",null,null,null,null,null,null,null,null,null,null,null,null,null,null,null,null,null,null,null,null,null,null,null,null,null,null,null,null,null,null,null,null,null,null,null,null,null,null,null,null,1]
["E15",18.116848000000001,0.40500000000000003,"E15","E03","E11",null,null,null,null,null,null,null,null,null,null,null,null,null,null,null,null,null,null,null,null,null,null,null,null,null,null,null,null,null,null,null,null,null,null,null,null,null,null,1,1.202705825067263E-4,1.6986137767523303E-3]
["E16",6.0373010000000003,0,"E16",null,null,null,null,null,null,null,null,null,null,null,null,null,null,null,null,null,null,null,null,null,null,null,null,null,null,null,null,null,null,null,null,null,null,null,null,null,null,null,null,1]
["E17",73.139326999999994,0,"E17",null,null,null,null,null,null,null,null,null,null,null,null,null,null,null,null,null,null,null,null,null,null,null,null,null,null,null,null,null,null,null,null,null,null,null,null,null,null,null,null,1]
["E18",33.892568999999995,0,"E18",null,null,null,null,null,null,null,null,null,null,null,null,null,null,null,null,null,null,null,null,null,null,null,null,null,null,null,null,null,null,null,null,null,null,null,null,null,null,null,null,1]
["E19",200.33766700000001,0,"E19",null,null,null,null,null,null,null,null,null,null,null,null,null,null,null,null,null,null,null,null,null,null,null,null,null,null,null,null,null,null,null,null,null,null,null,null,null,null,null,null,1]
["E20",4.2112280000000002,4.1523000000000003,"E20","E19",null,null,null,null,null,null,null,null,null,null,null,null,null,null,null,null,null,null,null,null,null,null,null,null,null,null,null,null,null,null,null,null,null,null,null,null,null,null,null,1,2.072632669737149E-2]
["E21",25.858530999999999,0,"E21",null,null,null,null,null,null,null,null,null,null,null,null,null,null,null,null,null,null,null,null,null,null,null,null,null,null,null,null,null,null,null,null,null,null,null,null,null,null,null,null,1]
["E22",1.9648429999999999,1.9855,"E22","E21",null,null,null,null,null,null,null,null,null,null,null,null,null,null,null,null,null,null,null,null,null,null,null,null,null,null,null,null,null,null,null,null,null,null,null,null,null,null,null,1,7.6784343639422242E-2]
["E23",83.555322000000004,0,"E23",null,null,null,null,null,null,null,null,null,null,null,null,null,null,null,null,null,null,null,null,null,null,null,null,null,null,null,null,null,null,null,null,null,null,null,null,null,null,null,null,1]
["E24",4.053553,0,"E24",null,null,null,null,null,null,null,null,null,null,null,null,null,null,null,null,null,null,null,null,null,null,null,null,null,null,null,null,null,null,null,null,null,null,null,null,null,null,null,null,1]
["E25",12.378213000000001,0,"E25",null,null,null,null,null,null,null,null,null,null,null,null,null,null,null,null,null,null,null,null,null,null,null,null,null,null,null,null,null,null,null,null,null,null,null,null,null,null,null,null,1]
["E26",422.94312600000001,0,"E26",null,null,null,null,null,null,null,null,null,null,null,null,null,null,null,null,null,null,null,null,null,null,null,null,null,null,null,null,null,null,null,null,null,null,null,null,null,null,null,null,1]
["E27",296.924755,0,"E27",null,null,null,null,null,null,null,null,null,null,null,null,null,null,null,null,null,null,null,null,null,null,null,null,null,null,null,null,null,null,null,null,null,null,null,null,null,null,null,null,1]
["E28",34.299948999999998,0,"E28",null,null,null,null,null,null,null,null,null,null,null,null,null,null,null,null,null,null,null,null,null,null,null,null,null,null,null,null,null,null,null,null,null,null,null,null,null,null,null,null,1]
["E29",70.536862999999997,0,"E29",null,null,null,null,null,null,null,null,null,null,null,null,null,null,null,null,null,null,null,null,null,null,null,null,null,null,null,null,null,null,null,null,null,null,null,null,null,null,null,null,1]
["E30",240.82562000000001,0,"E30",null,null,null,null,null,null,null,null,null,null,null,null,null,null,null,null,null,null,null,null,null,null,null,null,null,null,null,null,null,null,null,null,null,null,null,null,null,null,null,null,1]
["Q123",234.995148,0,"Q123",null,null,null,null,null,null,null,null,null,null,null,null,null,null,null,null,null,null,null,null,null,null,null,null,null,null,null,null,null,null,null,null,null,null,null,null,null,null,null,null,1]
["Q124",3.6288290000000001,0,"Q124",null,null,null,null,null,null,null,null,null,null,null,null,null,null,null,null,null,null,null,null,null,null,null,null,null,null,null,null,null,null,null,null,null,null,null,null,null,null,null,null,1]
["Q144",4.4767209999999995,0,"Q144",null,null,null,null,null,null,null,null,null,null,null,null,null,null,null,null,null,null,null,null,null,null,null,null,null,null,null,null,null,null,null,null,null,null,null,null,null,null,null,null,1]
["Q145",3.8772630000000001,0,"Q145",null,null,null,null,null,null,null,null,null,null,null,null,null,null,null,null,null,null,null,null,null,null,null,null,null,null,null,null,null,null,null,null,null,null,null,null,null,null,null,null,1]
["Q30",146.33428599999999,0,"Q30",null,null,null,null,null,null,null,null,null,null,null,null,null,null,null,null,null,null,null,null,null,null,null,null,null,null,null,null,null,null,null,null,null,null,null,null,null,null,null,null,1]
["Q31",143.437713,0,"Q31",null,null,null,null,null,null,null,null,null,null,null,null,null,null,null,null,null,null,null,null,null,null,null,null,null,null,null,null,null,null,null,null,null,null,null,null,null,null,null,null,1]
["Q46",292.76907000000006,100.0421,"Q46","1292","307","3085","3086","4853",null,null,null,null,null,null,null,null,null,null,null,null,null,null,null,null,null,null,null,null,null,null,null,null,null,null,null,null,null,null,null,null,null,null,null,1,6.6069778335569193E-2,6.7264291073053182E-3,0.14593227926806501,0.26023505765046878,0.15016851043723164]
["Q47",109.37035400000001,109.40989999999999,"Q47","1292",null,null,null,null,null,null,null,null,null,null,null,null,null,null,null,null,null,null,null,null,null,null,null,null,null,null,null,null,null,null,null,null,null,null,null,null,null,null,null,1,0.2457718475749851]
["Q48",170.58604199999999,0,"Q48",null,null,null,null,null,null,null,null,null,null,null,null,null,null,null,null,null,null,null,null,null,null,null,null,null,null,null,null,null,null,null,null,null,null,null,null,null,null,null,null,1]
["Q49",44.998434000000003,0,"Q49",null,null,null,null,null,null,null,null,null,null,null,null,null,null,null,null,null,null,null,null,null,null,null,null,null,null,null,null,null,null,null,null,null,null,null,null,null,null,null,null,1]
["Q82",6.2376870000000002,0,"Q82",null,null,null,null,null,null,null,null,null,null,null,null,null,null,null,null,null,null,null,null,null,null,null,null,null,null,null,null,null,null,null,null,null,null,null,null,null,null,null,null,1]
["Q85",55.307647000000003,38.3902,"Q85","1537","2946","2947","4853","653","C76","C96","E19","5519",null,null,null,null,null,null,null,null,null,null,null,null,null,null,null,null,null,null,null,null,null,null,null,null,null,null,null,null,null,null,null,1,8.7523951472963917E-3,4.5255252102721381E-3,2.8515328347457819E-2,1.5546685084590381E-2,1.000313927957892E-2,2.3161268084356127E-3,5.0349186230512551E-2,6.6729558419315873E-4,3.4047071618096363E-3]
["Q88",228.82160200000001,0,"Q88",null,null,null,null,null,null,null,null,null,null,null,null,null,null,null,null,null,null,null,null,null,null,null,null,null,null,null,null,null,null,null,null,null,null,null,null,null,null,null,null,1]
["Q89",49.429165999999995,0,"Q89",null,null,null,null,null,null,null,null,null,null,null,null,null,null,null,null,null,null,null,null,null,null,null,null,null,null,null,null,null,null,null,null,null,null,null,null,null,null,null,null,1]
["Q94",199.87639100000001,0,"Q94",null,null,null,null,null,null,null,null,null,null,null,null,null,null,null,null,null,null,null,null,null,null,null,null,null,null,null,null,null,null,null,null,null,null,null,null,null,null,null,null,1]
[]
[]
[]
[]
[]
[]
[]
[]
[]
[]
[]
[]
[]
[]
[]
[]
[]
[]
[]
[]
[]
[]
[]
[]
[]
[]
[]
[]
[]
[]
[]
[]
[]
[]
[]
[]
[]
[]
[]
[]
[]
[]
[]
[]
[]
[]
[]
[]
[]
[]
[]
[]
[]
[]
[]
[]
[]
[]
[]
[]
[]
[]
[]
[]
[]
[]
[]
[]
[]
[]
[]
[]
[]
[]
[]
[]
[]
[]
[]
[]
[]
[]
[]
[]
[]
[]
[]
[]
[]
[]
[]
[]
[]
[]
[]
[]
[]
[]
[]
[]
[]
[]
[]
[]
[]
[]
[]
[]
[]
[]
[]
[]
[]
[]
[]
[]
[]
[]
[]
[]
[]
[]
[]
[]
[]
[]
[]
[]
[]
[]
[]
[]
[]
[]
[]
[]
[]
[]
[]
[]
[]
[]
[]
[]
[]
[]
[]
[]
[]
[]
[]
[]
[]
[]
[]
[]
[]
[]
[]
[]
[]
[]
[]
[]
[]
[]
[]
[]
[]
[]
[]
[]
[]
[]
[]
[]
[]
[]
[]
[]
[]
[]
[]
[]
[]
[]
[]
[]
[]
[]
[]
[]
[]
[]
[]
[]
[]
[]
[]
[]
[]
[]
[]
[]
[]
[]
[]
[]
[]
[]
[]
[]
[]
[]
[]
[]
[]
[]
[]
[]
[]
[]
[]
[]
[]
[]
[]
[]
[]
[]
[]
[]
[]
[]
[]
[]
[]
[]
[]
[]
[]
[]
[]
[]
[]
[]
[]
[]
[]
[]
[]
[]
[]
[]
[]
[]
[]
[]
[]
[]
[]
[]
[]
[]
[]
[]
[]
[]
[]
[]
[]
[]
[]
[]
[]
[]
[]
[]
[]
[]
[]
[]
[]
[]
[]
[]
[]
[]
[]
[]
[]
[]
[]
[]
[]
[]
[]
[]
[]
[]
[]
[]
[]
[]
[]
[]
[]
[]
[]
[]
[]
[]
[]
[]
[]
[]
[]
[]
[]
[]
[]
[]
[]
[]
[]
[]
[]
[]
[]
[]
[]
[]
[]
[]
[]
[]
[]
[]
[]
[]
[]
[]
[]
[]
[]
[]
[]
[]
[]
[]
[]
[]
[]
[]
[]
[]
[]
[]
[]
[]
[]
[]
[]
[]
[]
[]
[]
[]
[]
[]
[]
[]
[]
[]
[]
[]
[]
[]
[]
[]
[]
[]
[]
[]
[]
[]
[]
[]
[]
[]
[]
[]
[]
[]
[]
[]
[]
[]
[]
[]
[]
[]
[]
[]
[]
[]
[]
[]
[]
[]
[]
[]
[]
[]
[]
[]
[]
[]
[]
[]
[]
[]
[]
[]
[]
[]
[]
[]
[]
[]
[]
[]
[]
[]
[]
[]
[]
[]
[]
[]
[]
[]
[]
[]
[]
[]
[]
[]
[]
[]
[]
[]
[]
[]
[]
[]
[]
[]
[]
[]
[]
[]
[]
[]
[]
[]
[]
[]
[]
[]
[]
[]
[]
[]
[]
[]
[]
[]
[]
[]
[]
[]
[]
[]
[]
[]
[]
[]
[]
[]
[]
[]
[]
[]
[]
[]
[]
[]
[]
[]
[]
[]
[]
[]
[]
[]
[]
[]
[]
[]
[]
[]
[]
[]
[]
[]
[]
[]
[]
[]
[]
[]
[]
[]
[]
[]
[]
[]
[]
[]
[]
[]
[]
[]
[]
[]
[]
[]
[]
[]
[]
[]
[]
[]
[]
[]
[]
[]
[]
[]
[]
[]
[]
[]
[]
[]
[]
[]
[]
[]
[]
[]
[]
[]
[]
[]
[]
[]
[]
[]
[]
[]
[]
[]
[]
[]
[]
[]
[]
[]
[]
[]
[]
[]
[]
[]
[]
[]
[]
[]
[]
[]
[]
[]
[]
[]
[]
[]
[]
[]
[]
[]
[]
[]
[]
[]
[]
[]
[]
[]
[]
[]
[]
[]
[]
[]
[]
[]
[]
[]
[]
[]
[]
[]
[]
[]
[]
[]
[]
[]
[]
[]
[]
[]
[]
[]
[]
[]
[]
[]
[]
[]
[]
[]
[]
[]
[]
[]
[]
[]
[]
[]
[]
[]
[]
[]
[]
[]
[]
[]
[]
[]
[]
[]
[]
[]
[]
[]
[]
[]
[]
[]
[]
[]
[]
[]
[]
[]
[]
[]
[]
[]
[]
[]
[]
[]
[]
[]
[]
[]
[]
[]
[]
[]
[]
[]
[]
[]
[]
[]
[]
[]
[]
[]
[]
[]
[]
[]
[]
[]
[]
[]
[]
[]
[]
[]
[]
[]
[]
[]
[]
[]
[]
[]
[]
[]
[]
[]
[]
[]
[]
[]
[]
[]
[]
[]
[]
[]
[]
[]
[]
[]
[]
[]
[]
[]
[]
[]
[]
[]
[]
[]
[]
[]
[]
[]
[]
[]
[]
[]
[]
[]
[]
[]
[]
[]
[]
[]
[]
[]
[]
[]
[]
[]
[]
[]
[]
[null,"NAV\n(millions)",null,1,{"$f":"D1000+1","v":2},{"$f":"E1000+1","v":3},4,5,6,7,8,9,10,11,12,13,14,15,16,17,18,19,20,null,null,null,null,null,null,null,null,null,null,null,null,null,null,null,null,null,null,null,null,null,1,{"$f":"AS1000+1","v":2},{"$f":"AT1000+1","v":3},4,5,6,7,8,9,10,11,12,13,14,15,16,17,18,19,20]
[null,356.22598399999998,null,"086",null,null,null,null,null,null,null,null,null,null,null,null,null,null,null,null,null,null,null,null,null,null,null,null,null,null,null,null,null,null,null,null,null,null,null,null,null,null,null,null,1]
[null,58.017350999999998,null,"1216",1292,3091,3092,"Q94",2802,"Q48",null,null,null,null,null,null,null,null,null,null,null,null,null,null,null,null,null,null,null,null,null,null,null,null,null,null,null,null,null,null,null,null,null,null,6.6149395181445581E-2,0.3302194393406116,0.24844405902367223,0.10972486374777221,0.11998233909137605,5.0570240134856094E-2,7.4909663480266259E-2]
[null,23.630742000000001,null,"1232",2979,null,null,null,null,null,null,null,null,null,null,null,null,null,null,null,null,null,null,null,null,null,null,null,null,null,null,null,null,null,null,null,null,null,null,null,null,null,null,null,-1.7291066283231515E-6,1.0000017291066283]
[null,1.5286169999999999,null,"1233",null,null,null,null,null,null,null,null,null,null,null,null,null,null,null,null,null,null,null,null,null,null,null,null,null,null,null,null,null,null,null,null,null,null,null,null,null,null,null,null,1]
[null,10.535781,null,"1234",null,null,null,null,null,null,null,null,null,null,null,null,null,null,null,null,null,null,null,null,null,null,null,null,null,null,null,null,null,null,null,null,null,null,null,null,null,null,null,null,1]
[null,79.45855499999999,null,"1279",null,null,null,null,null,null,null,null,null,null,null,null,null,null,null,null,null,null,null,null,null,null,null,null,null,null,null,null,null,null,null,null,null,null,null,null,null,null,null,null,1]
[null,14.936425999999999,null,"1280",null,null,null,null,null,null,null,null,null,null,null,null,null,null,null,null,null,null,null,null,null,null,null,null,null,null,null,null,null,null,null,null,null,null,null,null,null,null,null,null,1]
[null,39.523705,null,"1290",null,null,null,null,null,null,null,null,null,null,null,null,null,null,null,null,null,null,null,null,null,null,null,null,null,null,null,null,null,null,null,null,null,null,null,null,null,null,null,null,1]
[null,438.59778699999998,null,"1292",null,null,null,null,null,null,null,null,null,null,null,null,null,null,null,null,null,null,null,null,null,null,null,null,null,null,null,null,null,null,null,null,null,null,null,null,null,null,null,null,1]
[null,216.77944399999998,null,"1537",null,null,null,null,null,null,null,null,null,null,null,null,null,null,null,null,null,null,null,null,null,null,null,null,null,null,null,null,null,null,null,null,null,null,null,null,null,null,null,null,1]
[null,147.40842499999997,null,"1579",null,null,null,null,null,null,null,null,null,null,null,null,null,null,null,null,null,null,null,null,null,null,null,null,null,null,null,null,null,null,null,null,null,null,null,null,null,null,null,null,1]
[null,170.01653099999999,null,"1870",1579,3864,4324,756,3997,null,null,null,null,null,null,null,null,null,null,null,null,null,null,null,null,null,null,null,null,null,null,null,null,null,null,null,null,null,null,null,null,null,null,null,5.2684809415555756E-3,3.6712574250146311E-2,0.78579012742880849,3.5832720530066205E-2,3.5860902912364392E-2,0.10053519393705905]
[null,114.142318,null,"2214",null,null,null,null,null,null,null,null,null,null,null,null,null,null,null,null,null,null,null,null,null,null,null,null,null,null,null,null,null,null,null,null,null,null,null,null,null,null,null,null,1]
[null,2202.4657830000001,null,"2238",null,null,null,null,null,null,null,null,null,null,null,null,null,null,null,null,null,null,null,null,null,null,null,null,null,null,null,null,null,null,null,null,null,null,null,null,null,null,null,null,1]
[null,147.77404899999999,null,"2309",2945,295,756,2238,2421,null,null,null,null,null,null,null,null,null,null,null,null,null,null,null,null,null,null,null,null,null,null,null,null,null,null,null,null,null,null,null,null,null,null,null,-4.3069531852696352E-4,0.20049097737085009,0.20092164216979985,0.24869778452231109,0.24972914917373826,0.10059114208182765]
[null,217.623547,null,"2338",292,3072,736,611,null,null,null,null,null,null,null,null,null,null,null,null,null,null,null,null,null,null,null,null,null,null,null,null,null,null,null,null,null,null,null,null,null,null,null,null,-2.7083035609670736E-4,0.24730278540690687,0.25207544235801743,0.25006455042768816,0.25082805216348419]
[null,256.72807799999998,null,"2421",null,null,null,null,null,null,null,null,null,null,null,null,null,null,null,null,null,null,null,null,null,null,null,null,null,null,null,null,null,null,null,null,null,null,null,null,null,null,null,null,1]
[null,249.24429900000001,null,"2524",756,736,611,302,null,null,null,null,null,null,null,null,null,null,null,null,null,null,null,null,null,null,null,null,null,null,null,null,null,null,null,null,null,null,null,null,null,null,null,null,1.9946074193070706E-3,0.19928761769075562,0.29964886214047826,0.30010804941176183,0.19896086333769719]
[null,21.992933999999998,null,"2802",null,null,null,null,null,null,null,null,null,null,null,null,null,null,null,null,null,null,null,null,null,null,null,null,null,null,null,null,null,null,null,null,null,null,null,null,null,null,null,null,1]
[null,58.537112999999998,null,"2812",null,null,null,null,null,null,null,null,null,null,null,null,null,null,null,null,null,null,null,null,null,null,null,null,null,null,null,null,null,null,null,null,null,null,null,null,null,null,null,null,1]
[null,2.8314301404800002,null,"2815",null,null,null,null,null,null,null,null,null,null,null,null,null,null,null,null,null,null,null,null,null,null,null,null,null,null,null,null,null,null,null,null,null,null,null,null,null,null,null,null,1]
[null,398.53743500000002,null,"2891",3914,3864,3998,3999,742,4297,756,3997,"C35",2947,null,null,null,null,null,null,null,null,null,null,null,null,null,null,null,null,null,null,null,null,null,null,null,null,null,null,null,null,null,null,2.2850657177971665E-3,0.23765733301316266,9.8111434234277636E-2,0.38349887390744258,0.10883290198109387,1.5674624163252934E-2,3.3454693787835214E-2,2.5492293646719229E-2,5.3073926236282973E-2,2.9992684074317745E-2,1.1926169237818083E-2]
[null,1074.247437,null,"2898",3914,3864,3998,3999,742,4297,756,3997,"C35",2947,null,null,null,null,null,null,null,null,null,null,null,null,null,null,null,null,null,null,null,null,null,null,null,null,null,null,null,null,null,null,1.5098813830036421E-3,0.19125060689930456,0.21926895930118148,0.29687323253470288,0.10762792727261895,1.3852940337579594E-2,2.724874577308728E-2,2.6689534840856958E-2,8.2901692375517963E-2,2.2833895525369668E-2,9.9425837567770712E-3]
[null,762.98925499999996,null,"2905",3914,3864,3998,3999,4297,4324,756,3997,"C35",2947,null,null,null,null,null,null,null,null,null,null,null,null,null,null,null,null,null,null,null,null,null,null,null,null,null,null,null,null,null,null,3.3847229050262932E-3,0.15050679565231123,0.32814750098068218,0.23501116741741987,8.1818854550122791E-2,2.6601633391189101E-2,2.3736358648804121E-2,3.4640682942735895E-2,9.4842691411268817E-2,1.5295157861322562E-2,6.0144342391171141E-3]
[null,1290.4565740000003,null,"291",null,null,null,null,null,null,null,null,null,null,null,null,null,null,null,null,null,null,null,null,null,null,null,null,null,null,null,null,null,null,null,null,null,null,null,null,null,null,null,null,1]
[null,532.54481099999998,null,"2912",2945,3914,3864,3998,3999,4297,4324,756,3997,"C35",null,null,null,null,null,null,null,null,null,null,null,null,null,null,null,null,null,null,null,null,null,null,null,null,null,null,null,null,null,null,4.3750686139457408E-3,3.9816731831763257E-2,6.7606454987448938E-2,0.43604035266140995,0.17257624051535192,5.2748503900516913E-2,1.7517535369794238E-2,2.5655456160683567E-2,3.1600373865259788E-2,0.13792959397969898,1.4133688114126738E-2]
[null,224.268832,null,"292",null,null,null,null,null,null,null,null,null,null,null,null,null,null,null,null,null,null,null,null,null,null,null,null,null,null,null,null,null,null,null,null,null,null,null,null,null,null,null,null,1]
[null,1044.1289770000001,null,"2942",null,null,null,null,null,null,null,null,null,null,null,null,null,null,null,null,null,null,null,null,null,null,null,null,null,null,null,null,null,null,null,null,null,null,null,null,null,null,null,null,1]
[null,1395.8488500000001,null,"2945",null,null,null,null,null,null,null,null,null,null,null,null,null,null,null,null,null,null,null,null,null,null,null,null,null,null,null,null,null,null,null,null,null,null,null,null,null,null,null,null,1]
[null,891.57806600000004,null,"2946",null,null,null,null,null,null,null,null,null,null,null,null,null,null,null,null,null,null,null,null,null,null,null,null,null,null,null,null,null,null,null,null,null,null,null,null,null,null,null,null,1]
[null,270.64184999999998,null,"2947",null,null,null,null,null,null,null,null,null,null,null,null,null,null,null,null,null,null,null,null,null,null,null,null,null,null,null,null,null,null,null,null,null,null,null,null,null,null,null,null,1]
[null,527.08203600000002,null,"295",null,null,null,null,null,null,null,null,null,null,null,null,null,null,null,null,null,null,null,null,null,null,null,null,null,null,null,null,null,null,null,null,null,null,null,null,null,null,null,null,1]
[null,187.05309,null,"296",null,null,null,null,null,null,null,null,null,null,null,null,null,null,null,null,null,null,null,null,null,null,null,null,null,null,null,null,null,null,null,null,null,null,null,null,null,null,null,null,1]
[null,818.34745399999997,null,"2979",null,null,null,null,null,null,null,null,null,null,null,null,null,null,null,null,null,null,null,null,null,null,null,null,null,null,null,null,null,null,null,null,null,null,null,null,null,null,null,null,1]
[null,355.13179700000001,null,"299",null,null,null,null,null,null,null,null,null,null,null,null,null,null,null,null,null,null,null,null,null,null,null,null,null,null,null,null,null,null,null,null,null,null,null,null,null,null,null,null,1]
[null,1087.6579180000001,null,"302",null,null,null,null,null,null,null,null,null,null,null,null,null,null,null,null,null,null,null,null,null,null,null,null,null,null,null,null,null,null,null,null,null,null,null,null,null,null,null,null,1]
[null,1387.360876,null,"3069",null,null,null,null,null,null,null,null,null,null,null,null,null,null,null,null,null,null,null,null,null,null,null,null,null,null,null,null,null,null,null,null,null,null,null,null,null,null,null,null,1]
[null,472.75766399999998,null,"307",null,null,null,null,null,null,null,null,null,null,null,null,null,null,null,null,null,null,null,null,null,null,null,null,null,null,null,null,null,null,null,null,null,null,null,null,null,null,null,null,1]
[null,274.45360299999999,null,"3070",null,null,null,null,null,null,null,null,null,null,null,null,null,null,null,null,null,null,null,null,null,null,null,null,null,null,null,null,null,null,null,null,null,null,null,null,null,null,null,null,1]
[null,370.23282999999992,null,"3071",null,null,null,null,null,null,null,null,null,null,null,null,null,null,null,null,null,null,null,null,null,null,null,null,null,null,null,null,null,null,null,null,null,null,null,null,null,null,null,null,1]
[null,1426.520767,null,"3072",null,null,null,null,null,null,null,null,null,null,null,null,null,null,null,null,null,null,null,null,null,null,null,null,null,null,null,null,null,null,null,null,null,null,null,null,null,null,null,null,1]
[null,78.287790000000001,null,"3075",null,null,null,null,null,null,null,null,null,null,null,null,null,null,null,null,null,null,null,null,null,null,null,null,null,null,null,null,null,null,null,null,null,null,null,null,null,null,null,null,1]
[null,162.631438,null,"3077",1292,3085,"Q88",3091,3092,3069,"Q94",1290,2979,611,302,3098,null,null,null,null,null,null,null,null,null,null,null,null,null,null,null,null,null,null,null,null,null,null,null,null,null,null,null,null,1.7698954199496207E-3,4.5169682668906495E-2,4.5237036267289095E-2,3.5182252320277635E-2,0.11966532938903558,0.18931160021988372,0.18931305375222743,3.0101422173085882E-2,3.4924620522236174E-2,4.9918368593026931E-2,3.0021266126959493E-2,0.19928929235067769,3.0096180196444226E-2]
[null,163.73356000000001,null,"3078",1292,3085,"Q88",3087,3091,3092,3069,"Q94",1290,2979,611,302,3098,null,null,null,null,null,null,null,null,null,null,null,null,null,null,null,null,null,null,null,null,null,null,null,null,null,null,null,8.0748563520253308E-4,7.0223676264370899E-2,7.0560713866915523E-2,3.5283881683417451E-2,5.0235283594814995E-2,9.9595528223895405E-2,0.1492298456150723,0.14924357279141237,4.0113627135786423E-2,4.0432138669155265E-2,3.9888549570766173E-2,5.4976333263300883E-2,0.15926024053706753,4.0149123148822234E-2]
[null,387.48153600000001,null,"3079",1292,3085,"Q88",3087,3091,3069,"Q94",1537,"Q89",2979,302,3098,"C55",653,null,null,null,null,null,null,null,null,null,null,null,null,null,null,null,null,null,null,null,null,null,null,null,null,null,null,5.3947078763764977E-4,0.10047364803222864,7.5520944303147375E-2,6.5596241110865941E-2,7.5242259514325199E-2,6.977245613016364E-2,0.14934111484032139,5.5140384534487448E-2,4.9246291448753032E-2,4.4927213402446306E-2,2.9955094527093554E-2,0.14948873535897841,5.5184202884524809E-2,4.9752732736917771E-2,2.9819210388108849E-2]
[null,287.84571799999998,null,"3080",1292,3085,"Q88",3087,3070,3069,1537,"Q89",302,3098,"C89","C55",653,296,null,null,null,null,null,null,null,null,null,null,null,null,null,null,null,null,null,null,null,null,null,null,null,null,null,null,9.1040453270625071E-4,0.10052412719731441,8.5836142141432023E-2,6.5624641570118991E-2,8.0501988183252354E-2,9.0200009727433833E-2,9.4395705060037374E-2,5.8559151170227662E-2,4.4962111402046305E-2,0.10448967526699199,9.9964061266157533E-2,3.0024574346603057E-2,6.4498892913807643E-2,4.4926759475649627E-2,3.4581755746220973E-2]
[null,235.871511,null,"3081",1292,3085,3087,3070,1537,"Q89",3098,"C89","C55",653,296,3086,null,null,null,null,null,null,null,null,null,null,null,null,null,null,null,null,null,null,null,null,null,null,null,null,null,null,null,null,-4.1214360361475216E-4,0.13596826191379627,0.1364965899652989,9.5626016877833897E-2,0.12529138005227422,6.3268070453615641E-2,4.4925246967098618E-2,0.11911670774129135,4.0056655679045587E-2,6.9566999913088276E-2,7.0424094941525364E-2,4.935328549655215E-2,5.0318833602194413E-2]
[null,140.40311,null,"3085",null,null,null,null,null,null,null,null,null,null,null,null,null,null,null,null,null,null,null,null,null,null,null,null,null,null,null,null,null,null,null,null,null,null,null,null,null,null,null,null,1]
[null,63.120586000000003,null,"3086",null,null,null,null,null,null,null,null,null,null,null,null,null,null,null,null,null,null,null,null,null,null,null,null,null,null,null,null,null,null,null,null,null,null,null,null,null,null,null,null,1]
[null,117.803878,null,"3087",null,null,null,null,null,null,null,null,null,null,null,null,null,null,null,null,null,null,null,null,null,null,null,null,null,null,null,null,null,null,null,null,null,null,null,null,null,null,null,null,1]
[null,161.74563499999999,null,"3091",null,null,null,null,null,null,null,null,null,null,null,null,null,null,null,null,null,null,null,null,null,null,null,null,null,null,null,null,null,null,null,null,null,null,null,null,null,null,null,null,1]
[null,116.459626,null,"3092",null,null,null,null,null,null,null,null,null,null,null,null,null,null,null,null,null,null,null,null,null,null,null,null,null,null,null,null,null,null,null,null,null,null,null,null,null,null,null,null,1]
[null,314.396252,null,"3093",null,null,null,null,null,null,null,null,null,null,null,null,null,null,null,null,null,null,null,null,null,null,null,null,null,null,null,null,null,null,null,null,null,null,null,null,null,null,null,null,1]
[null,137.930251,null,"3098",null,null,null,null,null,null,null,null,null,null,null,null,null,null,null,null,null,null,null,null,null,null,null,null,null,null,null,null,null,null,null,null,null,null,null,null,null,null,null,null,1]
[null,89.284868000000003,null,"3102",null,null,null,null,null,null,null,null,null,null,null,null,null,null,null,null,null,null,null,null,null,null,null,null,null,null,null,null,null,null,null,null,null,null,null,null,null,null,null,null,1]
[null,1291.0622230000001,null,"3864",null,null,null,null,null,null,null,null,null,null,null,null,null,null,null,null,null,null,null,null,null,null,null,null,null,null,null,null,null,null,null,null,null,null,null,null,null,null,null,null,1]
[null,639.89069599999993,null,"3914",null,null,null,null,null,null,null,null,null,null,null,null,null,null,null,null,null,null,null,null,null,null,null,null,null,null,null,null,null,null,null,null,null,null,null,null,null,null,null,null,1]
[null,26.004695999999999,null,"3969",null,null,null,null,null,null,null,null,null,null,null,null,null,null,null,null,null,null,null,null,null,null,null,null,null,null,null,null,null,null,null,null,null,null,null,null,null,null,null,null,1]
[null,32.404998999999997,null,"3972",null,null,null,null,null,null,null,null,null,null,null,null,null,null,null,null,null,null,null,null,null,null,null,null,null,null,null,null,null,null,null,null,null,null,null,null,null,null,null,null,1]
[null,386.37394700000004,null,"3997",null,null,null,null,null,null,null,null,null,null,null,null,null,null,null,null,null,null,null,null,null,null,null,null,null,null,null,null,null,null,null,null,null,null,null,null,null,null,null,null,1]
[null,1070.8499020000002,null,"3998",null,null,null,null,null,null,null,null,null,null,null,null,null,null,null,null,null,null,null,null,null,null,null,null,null,null,null,null,null,null,null,null,null,null,null,null,null,null,null,null,1]
[null,348.817948,null,"3999",null,null,null,null,null,null,null,null,null,null,null,null,null,null,null,null,null,null,null,null,null,null,null,null,null,null,null,null,null,null,null,null,null,null,null,null,null,null,null,null,1]
[null,102.676013,null,"4297",null,null,null,null,null,null,null,null,null,null,null,null,null,null,null,null,null,null,null,null,null,null,null,null,null,null,null,null,null,null,null,null,null,null,null,null,null,null,null,null,1]
[null,0.150481,null,"4299",null,null,null,null,null,null,null,null,null,null,null,null,null,null,null,null,null,null,null,null,null,null,null,null,null,null,null,null,null,null,null,null,null,null,null,null,null,null,null,null,1]
[null,448.92792499999996,null,"4324",null,null,null,null,null,null,null,null,null,null,null,null,null,null,null,null,null,null,null,null,null,null,null,null,null,null,null,null,null,null,null,null,null,null,null,null,null,null,null,null,1]
[null,90.752378999999991,null,"4345",null,null,null,null,null,null,null,null,null,null,null,null,null,null,null,null,null,null,null,null,null,null,null,null,null,null,null,null,null,null,null,null,null,null,null,null,null,null,null,null,1]
[null,117.823477,null,"4444",2945,3914,1579,3864,3998,3999,4324,756,3997,null,null,null,null,null,null,null,null,null,null,null,null,null,null,null,null,null,null,null,null,null,null,null,null,null,null,null,null,null,null,null,4.2875905061384723E-3,2.0014540647663667E-2,4.1026204619621712E-2,2.5784250085933619E-2,0.52290630392069493,8.1135408046781834E-2,7.4022910370172348E-2,2.5864915063633316E-2,2.6880732875869413E-2,0.17807714386349074]
[null,86.323888000000011,null,"488",734,null,null,null,null,null,null,null,null,null,null,null,null,null,null,null,null,null,null,null,null,null,null,null,null,null,null,null,null,null,null,null,null,null,null,null,null,null,null,null,0.72512404444192158,0.27487595555807837]
[null,3474.1619759999999,null,"611",null,null,null,null,null,null,null,null,null,null,null,null,null,null,null,null,null,null,null,null,null,null,null,null,null,null,null,null,null,null,null,null,null,null,null,null,null,null,null,null,1]
[null,1018.4689179999999,null,"612",null,null,null,null,null,null,null,null,null,null,null,null,null,null,null,null,null,null,null,null,null,null,null,null,null,null,null,null,null,null,null,null,null,null,null,null,null,null,null,null,1]
[null,1186.4705589999999,null,"613",null,null,null,null,null,null,null,null,null,null,null,null,null,null,null,null,null,null,null,null,null,null,null,null,null,null,null,null,null,null,null,null,null,null,null,null,null,null,null,null,1]
[null,419.97635200000002,null,"618",null,null,null,null,null,null,null,null,null,null,null,null,null,null,null,null,null,null,null,null,null,null,null,null,null,null,null,null,null,null,null,null,null,null,null,null,null,null,null,null,1]
[null,560.87868900000001,null,"650",null,null,null,null,null,null,null,null,null,null,null,null,null,null,null,null,null,null,null,null,null,null,null,null,null,null,null,null,null,null,null,null,null,null,null,null,null,null,null,null,1]
[null,1176.653814,null,"653","C87",null,null,null,null,null,null,null,null,null,null,null,null,null,null,null,null,null,null,null,null,null,null,null,null,null,null,null,null,null,null,null,null,null,null,null,null,null,null,null,0.92920834655019169,7.079165344980827E-2]
[null,58.080114999999999,null,"655",null,null,null,null,null,null,null,null,null,null,null,null,null,null,null,null,null,null,null,null,null,null,null,null,null,null,null,null,null,null,null,null,null,null,null,null,null,null,null,null,1]
[null,382.37476500000002,null,"724",null,null,null,null,null,null,null,null,null,null,null,null,null,null,null,null,null,null,null,null,null,null,null,null,null,null,null,null,null,null,null,null,null,null,null,null,null,null,null,null,1]
[null,469.85174600000005,null,"734",null,null,null,null,null,null,null,null,null,null,null,null,null,null,null,null,null,null,null,null,null,null,null,null,null,null,null,null,null,null,null,null,null,null,null,null,null,null,null,null,1]
[null,4738.7701269999998,null,"736","C24",null,null,null,null,null,null,null,null,null,null,null,null,null,null,null,null,null,null,null,null,null,null,null,null,null,null,null,null,null,null,null,null,null,null,null,null,null,null,null,0.99243299082603731,7.5670091739626702E-3]
[null,1503.1005290000001,null,"738",null,null,null,null,null,null,null,null,null,null,null,null,null,null,null,null,null,null,null,null,null,null,null,null,null,null,null,null,null,null,null,null,null,null,null,null,null,null,null,null,1]
[null,1860.872928,null,"740",null,null,null,null,null,null,null,null,null,null,null,null,null,null,null,null,null,null,null,null,null,null,null,null,null,null,null,null,null,null,null,null,null,null,null,null,null,null,null,null,1]
[null,981.14543500000013,null,"742","C89",null,null,null,null,null,null,null,null,null,null,null,null,null,null,null,null,null,null,null,null,null,null,null,null,null,null,null,null,null,null,null,null,null,null,null,null,null,null,null,0.98351834498739943,1.6481655012600578E-2]
[null,1714.3243359999999,null,"756",null,null,null,null,null,null,null,null,null,null,null,null,null,null,null,null,null,null,null,null,null,null,null,null,null,null,null,null,null,null,null,null,null,null,null,null,null,null,null,null,1]
[null,61.570239000000001,null,"C100",null,null,null,null,null,null,null,null,null,null,null,null,null,null,null,null,null,null,null,null,null,null,null,null,null,null,null,null,null,null,null,null,null,null,null,null,null,null,null,null,1]
[null,43.457160000000002,null,"C11",3914,"Q36","Q71",3864,3998,3999,742,4297,756,"Q39",3997,"Q42",2947,null,null,null,null,null,null,null,null,null,null,null,null,null,null,null,null,null,null,null,null,null,null,null,null,null,null,null,1.3313063427924422E-2,0.23744458478687078,7.4450445495798157E-2,2.128310245482912E-2,2.2839041861877893E-2,0.37929869480776485,0.10654420878473535,1.4734087792126505E-2,3.1189878317056784E-2,4.1733721914895576E-3,1.6793404775273142E-2,3.6186243246228475E-2,2.9995092182653279E-2,1.1754779875371629E-2]
[null,197.616387,null,"C12",3914,"Q36","Q71",3864,3998,3999,742,4297,756,"Q39",3997,"Q42",2947,null,null,null,null,null,null,null,null,null,null,null,null,null,null,null,null,null,null,null,null,null,null,null,null,null,null,null,3.7227640013681954E-3,0.19140597075951188,0.15284820288194706,2.2063825573181175E-2,6.5808149981479269E-2,0.29709362249287002,0.10700066720170998,1.3310160695164977E-2,2.6765476296501708E-2,4.8496621737871958E-3,3.9124750830396668E-2,4.3956008863636827E-2,2.2261823158401833E-2,9.7889150900431331E-3]
[null,171.74766700000001,null,"C13",3914,"Q36","Q71",3864,3998,3999,4297,4324,756,"Q39",3997,"Q42",2947,null,null,null,null,null,null,null,null,null,null,null,null,null,null,null,null,null,null,null,null,null,null,null,null,null,null,null,6.2077685465366517E-3,0.15027511937568888,0.17956429879410321,2.6285593868214833E-2,0.14904795889551942,0.23445675802354266,8.0850339538753646E-2,2.5125402494472999E-2,2.3513289319158272E-2,8.2243008785561605E-3,5.5533820889595617E-2,3.9347676562772022E-2,1.544030109282395E-2,6.127371720261756E-3]
[null,219.717817,null,"C14",2945,3914,"Q36","Q71",3864,3998,3999,4297,4324,756,"Q39",3997,"Q42",null,null,null,null,null,null,null,null,null,null,null,null,null,null,null,null,null,null,null,null,null,null,null,null,null,null,null,5.531806207781112E-3,4.0275517641265302E-2,6.6934178614568324E-2,0.29711902153580638,2.6018913579145611E-2,0.13824748786852953,0.17261457888254844,5.2056482997736186E-2,1.6829649805341216E-2,2.5751063773622344E-2,6.2031652419603693E-3,8.2852190764699074E-2,5.4628509706541754E-2,1.4937433380454383E-2]
[null,81.242552000000003,null,"C17",null,null,null,null,null,null,null,null,null,null,null,null,null,null,null,null,null,null,null,null,null,null,null,null,null,null,null,null,null,null,null,null,null,null,null,null,null,null,null,null,1]
[null,318.787847,null,"C19",null,null,null,null,null,null,null,null,null,null,null,null,null,null,null,null,null,null,null,null,null,null,null,null,null,null,null,null,null,null,null,null,null,null,null,null,null,null,null,null,1]
[null,290.05761799999999,null,"C22",null,null,null,null,null,null,null,null,null,null,null,null,null,null,null,null,null,null,null,null,null,null,null,null,null,null,null,null,null,null,null,null,null,null,null,null,null,null,null,null,1]
[null,715.93077700000003,null,"C24","Q11",null,null,null,null,null,null,null,null,null,null,null,null,null,null,null,null,null,null,null,null,null,null,null,null,null,null,null,null,null,null,null,null,null,null,null,null,null,null,null,0.95573524508234597,4.4264754917654053E-2]
[null,63.579520999999993,null,"C30",null,null,null,null,null,null,null,null,null,null,null,null,null,null,null,null,null,null,null,null,null,null,null,null,null,null,null,null,null,null,null,null,null,null,null,null,null,null,null,null,1]
[null,12.299412999999999,null,"C31",null,null,null,null,null,null,null,null,null,null,null,null,null,null,null,null,null,null,null,null,null,null,null,null,null,null,null,null,null,null,null,null,null,null,null,null,null,null,null,null,1]
[null,1030.5748610000001,null,"C35",null,null,null,null,null,null,null,null,null,null,null,null,null,null,null,null,null,null,null,null,null,null,null,null,null,null,null,null,null,null,null,null,null,null,null,null,null,null,null,null,1]
[null,324.816799,null,"C36",3914,3998,3999,742,4297,"Q42",2947,null,null,null,null,null,null,null,null,null,null,null,null,null,null,null,null,null,null,null,null,null,null,null,null,null,null,null,null,null,null,null,null,null,1.0200006311249846E-2,0.28285262825075547,0.48610950520416435,0.10251368709992834,2.7909172801406822E-2,4.8601850058248221E-2,2.5503906140322791E-2,1.6309244133924108E-2]
[null,302.60267600000003,null,"C42",null,null,null,null,null,null,null,null,null,null,null,null,null,null,null,null,null,null,null,null,null,null,null,null,null,null,null,null,null,null,null,null,null,null,null,null,null,null,null,null,1]
[null,81.070177000000001,null,"C44",null,null,null,null,null,null,null,null,null,null,null,null,null,null,null,null,null,null,null,null,null,null,null,null,null,null,null,null,null,null,null,null,null,null,null,null,null,null,null,null,1]
[null,49.675922999999997,null,"C46",null,null,null,null,null,null,null,null,null,null,null,null,null,null,null,null,null,null,null,null,null,null,null,null,null,null,null,null,null,null,null,null,null,null,null,null,null,null,null,null,1]
[null,212.07333299999999,null,"C49",736,611,null,null,null,null,null,null,null,null,null,null,null,null,null,null,null,null,null,null,null,null,null,null,null,null,null,null,null,null,null,null,null,null,null,null,null,null,null,null,4.3088953206273928E-3,0.50191108164016873,0.49378002303920387]
[null,692.78218500000003,null,"C51",2238,null,null,null,null,null,null,null,null,null,null,null,null,null,null,null,null,null,null,null,null,null,null,null,null,null,null,null,null,null,null,null,null,null,null,null,null,null,null,null,1.3307341874545964E-2,0.98669265812545404]
[null,296.50275899999997,null,"C55",null,null,null,null,null,null,null,null,null,null,null,null,null,null,null,null,null,null,null,null,null,null,null,null,null,null,null,null,null,null,null,null,null,null,null,null,null,null,null,null,1]
[null,78.919219999999996,null,"C56",2942,null,null,null,null,null,null,null,null,null,null,null,null,null,null,null,null,null,null,null,null,null,null,null,null,null,null,null,null,null,null,null,null,null,null,null,null,null,null,null,2.1114904864723005E-3,0.9978885095135277]
[null,26.628208999999998,null,"C57",2947,null,null,null,null,null,null,null,null,null,null,null,null,null,null,null,null,null,null,null,null,null,null,null,null,null,null,null,null,null,null,null,null,null,null,null,null,null,null,null,4.5428369172532124E-3,0.99545716308274679]
[null,170.75592800000001,null,"C58",2946,null,null,null,null,null,null,null,null,null,null,null,null,null,null,null,null,null,null,null,null,null,null,null,null,null,null,null,null,null,null,null,null,null,null,null,null,null,null,null,1.2598792779633383E-3,0.99874012072203666]
[null,86.939294000000004,null,"C62",2945,3914,1579,"Q36","Q71","Q44",3864,3998,3999,4324,756,"Q39",3997,null,null,null,null,null,null,null,null,null,null,null,null,null,null,null,null,null,null,null,null,null,null,null,null,null,null,null,1.389669447534099E-2,2.0286350016620793E-2,4.0471385782954318E-2,1.4481655591889976E-4,0.42284167896451891,2.1560694530551774E-2,2.5288707983616151E-2,9.6947239625807896E-2,8.0078133594358364E-2,7.1155177002805409E-2,2.5508034916315179E-2,4.9912869093724005E-3,9.9948708811780154E-2,7.6881090830038884E-2]
[null,45.057577000000002,null,"C63",742,null,null,null,null,null,null,null,null,null,null,null,null,null,null,null,null,null,null,null,null,null,null,null,null,null,null,null,null,null,null,null,null,null,null,null,null,null,null,null,9.8080634565533842E-4,0.99901919365434466]
[null,187.40827299999998,null,"C65",null,null,null,null,null,null,null,null,null,null,null,null,null,null,null,null,null,null,null,null,null,null,null,null,null,null,null,null,null,null,null,null,null,null,null,null,null,null,null,null,1]
[null,119.879509,null,"C69","Q36","Q71","Q44",3864,4324,"Q39",3997,null,null,null,null,null,null,null,null,null,null,null,null,null,null,null,null,null,null,null,null,null,null,null,null,null,null,null,null,null,null,null,null,null,4.9199783949715383E-3,0.76931486993189002,3.5092327128491529E-2,3.7269524063747346E-2,1.8127565263452047E-2,3.5153990799094086E-2,9.2287566431291421E-2,7.834177987062008E-3]
[null,10.29727127454,null,"C71","Q14",null,null,null,null,null,null,null,null,null,null,null,null,null,null,null,null,null,null,null,null,null,null,null,null,null,null,null,null,null,null,null,null,null,null,null,null,null,null,null,0.75558752002952234,0.24441247997047769]
[null,347.33705099999997,null,"C72",2979,null,null,null,null,null,null,null,null,null,null,null,null,null,null,null,null,null,null,null,null,null,null,null,null,null,null,null,null,null,null,null,null,null,null,null,null,null,null,null,2.547545047736044E-2,0.97452454952263956]
[null,212.86854600000001,null,"C75",null,null,null,null,null,null,null,null,null,null,null,null,null,null,null,null,null,null,null,null,null,null,null,null,null,null,null,null,null,null,null,null,null,null,null,null,null,null,null,null,1]
[null,1020.07813,null,"C76",null,null,null,null,null,null,null,null,null,null,null,null,null,null,null,null,null,null,null,null,null,null,null,null,null,null,null,null,null,null,null,null,null,null,null,null,null,null,null,null,1]
[null,218.88603499999999,null,"C84","Q11",null,null,null,null,null,null,null,null,null,null,null,null,null,null,null,null,null,null,null,null,null,null,null,null,null,null,null,null,null,null,null,null,null,null,null,null,null,null,null,0.99358010763593829,6.4198923640616575E-3]
[null,454.588573,null,"C85","Q11",null,null,null,null,null,null,null,null,null,null,null,null,null,null,null,null,null,null,null,null,null,null,null,null,null,null,null,null,null,null,null,null,null,null,null,null,null,null,null,0.97499748233897643,2.5002517661023613E-2]
[null,83.297438000000014,null,"C87","Q11",null,null,null,null,null,null,null,null,null,null,null,null,null,null,null,null,null,null,null,null,null,null,null,null,null,null,null,null,null,null,null,null,null,null,null,null,null,null,null,0.9938517666817932,6.1482333182068102E-3]
[null,72.095869999999991,null,"C88",null,null,null,null,null,null,null,null,null,null,null,null,null,null,null,null,null,null,null,null,null,null,null,null,null,null,null,null,null,null,null,null,null,null,null,null,null,null,null,null,1]
[null,206.635356,null,"C89",null,null,null,null,null,null,null,null,null,null,null,null,null,null,null,null,null,null,null,null,null,null,null,null,null,null,null,null,null,null,null,null,null,null,null,null,null,null,null,null,1]
[null,281.56104099999999,null,"C91",2945,null,null,null,null,null,null,null,null,null,null,null,null,null,null,null,null,null,null,null,null,null,null,null,null,null,null,null,null,null,null,null,null,null,null,null,null,null,null,null,2.4232338285486987E-3,0.9975767661714513]
[null,11.227923000000001,null,"C93",null,null,null,null,null,null,null,null,null,null,null,null,null,null,null,null,null,null,null,null,null,null,null,null,null,null,null,null,null,null,null,null,null,null,null,null,null,null,null,null,1]
[null,298.318715,null,"C96","Q11",null,null,null,null,null,null,null,null,null,null,null,null,null,null,null,null,null,null,null,null,null,null,null,null,null,null,null,null,null,null,null,null,null,null,null,null,null,null,null,0.95260789400731505,4.7392105992685001E-2]
[null,82.275357,null,"C98",null,null,null,null,null,null,null,null,null,null,null,null,null,null,null,null,null,null,null,null,null,null,null,null,null,null,null,null,null,null,null,null,null,null,null,null,null,null,null,null,1]
[null,86.943173999999999,null,"C99",null,null,null,null,null,null,null,null,null,null,null,null,null,null,null,null,null,null,null,null,null,null,null,null,null,null,null,null,null,null,null,null,null,null,null,null,null,null,null,null,1]
[null,59.111930999999998,null,"Q11",2812,null,null,null,null,null,null,null,null,null,null,null,null,null,null,null,null,null,null,null,null,null,null,null,null,null,null,null,null,null,null,null,null,null,null,null,null,null,null,null,9.742858713727709E-3,0.99025714128627229]
[null,2.6812116756600002,null,"Q14",2815,null,null,null,null,null,null,null,null,null,null,null,null,null,null,null,null,null,null,null,null,null,null,null,null,null,null,null,null,null,null,null,null,null,null,null,null,null,null,null,6.3497650305834874E-3,0.99365023496941651]
[null,6.1992310000000002,null,"Q30",3075,null,null,null,null,null,null,null,null,null,null,null,null,null,null,null,null,null,null,null,null,null,null,null,null,null,null,null,null,null,null,null,null,null,null,null,null,null,null,null,2.0323783714026877E-3,0.99796762162859731]
[null,2.1191520000000001,null,"Q31",1280,null,null,null,null,null,null,null,null,null,null,null,null,null,null,null,null,null,null,null,null,null,null,null,null,null,null,null,null,null,null,null,null,null,null,null,null,null,null,null,2.3884060022648645E-3,0.99761159399773514]
[null,258.54938399999998,null,"Q36",3864,null,null,null,null,null,null,null,null,null,null,null,null,null,null,null,null,null,null,null,null,null,null,null,null,null,null,null,null,null,null,null,null,null,null,null,null,null,null,null,1.2916494101320453E-3,0.99870835058986795]
[null,55.956195999999998,null,"Q39",3997,null,null,null,null,null,null,null,null,null,null,null,null,null,null,null,null,null,null,null,null,null,null,null,null,null,null,null,null,null,null,null,null,null,null,null,null,null,null,null,6.3727079394241271E-3,0.99362729206057587]
[null,19.920828,null,"Q42","C35",null,null,null,null,null,null,null,null,null,null,null,null,null,null,null,null,null,null,null,null,null,null,null,null,null,null,null,null,null,null,null,null,null,null,null,null,null,null,null,2.239911549736906E-3,0.99776008845026309]
[null,6.6664430000000001,null,"Q44",1579,null,null,null,null,null,null,null,null,null,null,null,null,null,null,null,null,null,null,null,null,null,null,null,null,null,null,null,null,null,null,null,null,null,null,null,null,null,null,null,1.0222038881555373E-2,0.98977796111844463]
[null,64.469584999999995,null,"Q46",1292,3085,1290,3086,null,null,null,null,null,null,null,null,null,null,null,null,null,null,null,null,null,null,null,null,null,null,null,null,null,null,null,null,null,null,null,null,null,null,null,null,0.44491105311650764,0.14962320101257029,0.13001613085857522,0.12996572741260998,0.14548388759973691]
[null,31.949186000000001,null,"Q47",1292,null,null,null,null,null,null,null,null,null,null,null,null,null,null,null,null,null,null,null,null,null,null,null,null,null,null,null,null,null,null,null,null,null,null,null,null,null,null,null,1.013406595470312E-2,0.98986593404529688]
[null,25.800501000000001,null,"Q48",null,null,null,null,null,null,null,null,null,null,null,null,null,null,null,null,null,null,null,null,null,null,null,null,null,null,null,null,null,null,null,null,null,null,null,null,null,null,null,null,1]
[null,4.8217889999999999,null,"Q49",3098,null,null,null,null,null,null,null,null,null,null,null,null,null,null,null,null,null,null,null,null,null,null,null,null,null,null,null,null,null,null,null,null,null,null,null,null,null,null,null,2.0290742046538135E-3,0.99797092579534619]
[null,21.59778,null,"Q71",756,null,null,null,null,null,null,null,null,null,null,null,null,null,null,null,null,null,null,null,null,null,null,null,null,null,null,null,null,null,null,null,null,null,null,null,null,null,null,null,1.7755900600987196E-2,0.9822440993990128]
[null,19.594631,null,"Q82",null,null,null,null,null,null,null,null,null,null,null,null,null,null,null,null,null,null,null,null,null,null,null,null,null,null,null,null,null,null,null,null,null,null,null,null,null,null,null,null,1]
[null,170.990331,null,"Q83",2214,null,null,null,null,null,null,null,null,null,null,null,null,null,null,null,null,null,null,null,null,null,null,null,null,null,null,null,null,null,null,null,null,null,null,null,null,null,null,null,0.33246840434808289,0.66753159565191711]
[null,145.96175099999999,null,"Q84",1292,2947,2946,null,null,null,null,null,null,null,null,null,null,null,null,null,null,null,null,null,null,null,null,null,null,null,null,null,null,null,null,null,null,null,null,null,null,null,null,null,0.7204772820696923,9.9802234420238709E-2,5.0036580118907818E-2,0.12968390339116123]
[null,59.966624000000003,null,"Q85","C96","C76",2947,653,"C17",null,null,null,null,null,null,null,null,null,null,null,null,null,null,null,null,null,null,null,null,null,null,null,null,null,null,null,null,null,null,null,null,null,null,null,0.44744485613658269,0.13474917137206377,6.9584640783369414E-2,0.10493746735682863,9.9321907195005221E-2,0.14396195715615023]
[null,87.736863999999997,null,"Q86","C24","C85",null,null,null,null,null,null,null,null,null,null,null,null,null,null,null,null,null,null,null,null,null,null,null,null,null,null,null,null,null,null,null,null,null,null,null,null,null,null,0.6648041635845352,0.157540737705572,0.17765509870989288]
[null,36.764075000000005,null,"Q87",742,"C76","C35","C89","C44","C17","C99",null,null,null,null,null,null,null,null,null,null,null,null,null,null,null,null,null,null,null,null,null,null,null,null,null,null,null,null,null,null,null,null,null,0.42511173100932692,5.8598747963366428E-2,6.9731193202063974E-2,0.12587241194534887,7.4057580900933256E-2,4.9626548453518514E-2,0.14874963347395967,4.825215305148229E-2]
[null,212.53619699999999,null,"Q88",null,null,null,null,null,null,null,null,null,null,null,null,null,null,null,null,null,null,null,null,null,null,null,null,null,null,null,null,null,null,null,null,null,null,null,null,null,null,null,null,1]
[null,83.593750999999997,null,"Q89",null,null,null,null,null,null,null,null,null,null,null,null,null,null,null,null,null,null,null,null,null,null,null,null,null,null,null,null,null,null,null,null,null,null,null,null,null,null,null,null,1]
[null,108.440037,null,"Q94",null,null,null,null,null,null,null,null,null,null,null,null,null,null,null,null,null,null,null,null,null,null,null,null,null,null,null,null,null,null,null,null,null,null,null,null,null,null,null,null,1]

{"sheet":"Data","index":4,"n_rows":3004,"n_cols":7,"rows_kept":3004,"cut":false,"hidden":true,"merged":[]}
["MPower fund code","Currency","gross exposure\n(millions)","net exposure\n(millions)","gross exposure\n(% of NAV)","net exposure\n(% of NAV)","% of exposure hedged"]
["086","AUD",97.228930739134356,98.97653972703111,5.7292314542528748E-2,5.83220961422109E-2,-1.7974166481225629E-2]
["086","BRL",4.814584854754056,5.4501825279593845,2.8370024003487285E-3,3.2115294216679313E-3,-0.13201505267431757]
["086","CAD",166.7980285555584,765.55739139326363,9.8286024997211896E-2,0.45110600861937594]
["086","CHF",2.1910807818475397E-5,-0.29239377637090469,1.2910981164495389E-8,-1.7229353525510986E-4,13345.728263480798]
["086","CLP",0.71763038678084567,0.71763038678084567,4.2286493878078028E-4,4.2286493878078028E-4,0]
["086","COP",0.26667484085703091,1.2080306659710369,1.571386083011843E-4,7.1183414613008747E-4,-3.5299761390639901]
["086","EUR",114.40124919612298,104.67062296504226,6.7411132706866231E-2,6.1677344476461782E-2,8.5056992816565202E-2]
["086","GBP",75.141129156752598,41.810703041735216,4.4277039498457571E-2,2.4637028626163869E-2,0.4435710041765073]
["086","HKD",60.746578999999997,60.746578999999997,3.5795026079102565E-2,3.5795026079102565E-2,0]
["086","IDR",0.62931523314525728,2.5850348023271663,3.7082508271636162E-4,1.5232362000943075E-3,-3.1076946277105195]
["086","INR",0,0.60339727391185727,0,3.55552880693649E-4]
["086","JPY",124.43256195000001,119.95958984485694,7.3322100987609454E-2,7.0686394487088744E-2,3.5946958216133362E-2]
["086","KOR",18.841999999999999,21.483400339377383,1.1102680883189331E-2,1.2659130572864264E-2,-0.14018683469787629]
["086","MXN",12.097618848676795,5.9285823795368384E-2,7.1285426984032899E-3,3.4934273564216522E-5,0.99509938075112581]
["086","NOK",3.3386230000000001,-0.35568567814272878,1.9672893407428203E-3,-2.0958839715208092E-4,1.1065366404480916]
["086","NTD",21.528254,27.176606153133964,1.2685560669474806E-2,1.6013861883365142E-2,-0.26236926381182446]
["086","NZD",3.3895270000000002,-2.0908418363657915,1.997284610230023E-3,-1.2320321455467015E-3,1.6168535717124517]
["086","PEN",-2.9259774472472151E-3,3.1337090272515411,-1.7241372395815083E-6,1.8465434301211932E-3,1071.9956189852937]
["086","PHP",0.34037472114795669,2.2514385148224387,2.0056638942842153E-4,1.3266640143400526E-3,-5.6145879083769152]
["086","RUB",8.2662082290085923,8.2662082290085923,4.8708774058314423E-3,4.8708774058314423E-3,0]
["086","SEK",24.732783000000001,24.494089156757454,1.4573834890254225E-2,1.4433184132887491E-2,9.6509092099561489E-3]
["086","THB",0.63520291392712136,4.3534842564565084,3.7429440873605824E-4,2.5652980803219086E-3,-5.853690625474675]
["086","USD",953.62736694288401,401.56385349912267,0.56192656494230642,0.23662219083030203,0.5789090504119585]
["086","ZAR",3.3573319855828978,2.9963925921768455,1.978313642652124E-3,1.7656294847517243E-3,0.10750780529182202]
["086","CZK",0.21723984872735994,0.21723984872735994,1.2800895422631365E-4,1.2800895422631365E-4,0]
["086","HUF",0.19341895425826808,0.19721969323906915,1.1397245122013294E-4,1.1621204319678789E-4,-1.9650292265183333E-2]
["086","MYR",0.62859962453107365,0.62859962453107365,3.7040340911055852E-4,3.7040340911055852E-4,0]
["086","PLN",0.50296040558619937,0.50296040558619937,2.9637028341487361E-4,2.9637028341487361E-4,0]
["086","RON",-2.9436131270174941E-3,-2.9436131270174941E-3,-1.7345290941960673E-6,-1.7345290941960673E-6,0]
["086","TRL",0.19916897583274595,0.19916897583274595,1.1736066131528641E-4,1.1736066131528641E-4,0]
["1081","CAD",1.1993,1.1993,4.9498739109080481E-2,4.9498739109080481E-2]
["1081","CHF",0.46747,0.46747,1.9293901085067833E-2,1.9293901085067833E-2,0]
["1081","EUR",3.8980143199999997,3.8980143199999997,0.1608828432161592,0.1608828432161592,0]
["1081","GBP",3.5922269300000003,3.5922269300000003,0.14826207256623289,0.14826207256623289,0]
["1081","ILS",0.34779399999999999,0.34779399999999999,1.4354510522557772E-2,1.4354510522557772E-2,0]
["1081","JPY",0.37713400000000002,0.37713400000000002,1.5565461081600899E-2,1.5565461081600899E-2,0]
["1081","KOR",0.42980699999999999,0.42980699999999999,1.7739435137377264E-2,1.7739435137377264E-2,0]
["1081","SEK",0.49651313000000002,0.49651313000000002,2.0492598921123123E-2,2.0492598921123123E-2,0]
["1081","TRL",0.109071,0.109071,4.5016901303814869E-3,4.5016901303814869E-3,0]
["1081","USD",13.311508999999999,13.311508999999999,0.54940624625963208,0.54940624625963208,0]
["1216","CAD",145.80266672973829,145.80266672973829,0.81513021008360409,0.81513021008360409]
["1216","USD",17.667851173226705,17.667851173226705,9.8774594193487039E-2,9.8774594193487039E-2,0]
["1216","AUD",1.0966916283789629,1.0966916283789629,6.131208005231514E-3,6.131208005231514E-3,0]
["1216","EUR",6.7068670815241171,6.7068670815241171,3.7495678891108407E-2,3.7495678891108407E-2,0]
["1216","GBP",2.9072678063808302,2.9072678063808302,1.6253487476859393E-2,1.6253487476859393E-2,0]
["1216","HKD",1.338264508552867,1.338264508552867,7.4817549944142074E-3,7.4817549944142074E-3,0]
["1216","JPY",0.23226256590666797,0.23226256590666797,1.2984963745072855E-3,1.2984963745072855E-3,0]
["1216","MXN",0.18641881309510405,0.18641881309510405,1.0422004596350434E-3,1.0422004596350434E-3,0]
["1216","NOK",0.29592747634601951,0.29592747634601951,1.6544239647589512E-3,1.6544239647589512E-3,0]
["1216","NZD",0.14538432944641366,0.14538432944641366,8.1279143696449312E-4,8.1279143696449312E-4,0]
["1216","SGD",4.7241078818195295E-2,4.7241078818195295E-2,2.6410786143596311E-4,2.6410786143596311E-4,0]
["1216","CHF",0.70255169177013388,0.70255169177013388,3.9277135387975537E-3,3.9277135387975537E-3,0]
["1216","KOR",0.66475129968787772,0.66475129968787772,3.7163851575659121E-3,3.7163851575659121E-3,0]
["1216","SEK",1.0764541545370516,1.0764541545370516,6.0180675759491323E-3,6.0180675759491323E-3,0]
["1219","CAD",79.461711637452012,84.904875665652298,0.85406058731202428,0.91256413286828875]
["1219","USD",8.1907325560137529,2.8152059636523474,8.8034623382159186E-2,3.0258050187632914E-2,0.65629375096792986]
["1219","AUD",0.22832399551234275,0.21380049378208685,2.4540438619596833E-3,2.2979441485006633E-3,6.3609178254200538E-2]
["1219","BRL",1.6841275709625427E-2,1.6962249659449903E-2,1.810113264268924E-4,1.8231156374254383E-4,-7.183182076600847E-3]
["1219","EUR",2.5775796165608469,2.5553723490818578,2.7704023935546437E-2,2.746533851693583E-2,8.6155505483935801E-3]
["1219","MXN",4.1785225802725576E-2,9.6834458586298119E-3,4.4911082022579106E-4,1.0407842074883799E-4,0.76825670622562059]
["1219","RUB",4.7915790205000329E-2,4.7915790205000329E-2,5.1500259786393075E-4,5.1500259786393075E-4,0]
["1219","ZAR",1.1900688290037761E-2,1.1933279792597527E-2,1.2790951290830881E-4,1.2825980888411882E-4,-2.7386233271102789E-3]
["1219","GBP",0.79480616729852982,0.79582782855910505,8.5426378069895798E-3,8.553618700784341E-3,-1.2854219086495533E-3]
["1219","JPY",1.614113509801377,1.6129684738336805,1.7348616129223882E-2,1.7336309194589422E-2,7.0938999069369846E-4]
["1219","CHF",1.8403547922498219E-4,8.4611447165479416E-5,1.9780274831011449E-6,9.0941034078367896E-7,0.5402438294952765]
["1219","COP",3.8479963529593104E-3,3.9487469310649902E-3,4.1358560713836865E-5,4.2441435675070486E-5,-2.6182607483034026E-2]
["1219","IDR",9.0807318539020045E-3,9.3363333223212466E-3,9.7600404277111273E-5,1.0034762851552126E-4,-2.814767273514529E-2]
["1219","INR",0,6.5715393972328628E-5,0,7.0631410795076764E-7]
["1219","KOR",0,2.9161851573763662E-4,0,3.1343382327113056E-6]
["1219","NOK",0,-1.2051437559701843E-4,0,-1.2952977765132855E-6]
["1219","NTD",0,6.219945932369929E-4,0,6.6852457197072754E-6]
["1219","NZD",0,-7.0517482241703544E-4,0,-7.5792732195223279E-6]
["1219","PEN",-4.2220520352291907E-5,1.1709445103673754E-4,-4.537893995188291E-7,1.258540164346023E-6,3.7734014185446001]
["1219","PHP",4.9114520192741606E-3,5.1210454527914982E-3,5.2788663995491833E-5,5.5041390336742601E-5,-4.2674433689838365E-2]
["1219","SEK",0,-7.948462658841024E-5,0,-8.5430687896709085E-7]
["1219","THB",9.1656884028707471E-3,9.5756795502753341E-3,9.8513523798614871E-5,1.0292014017937825E-4,-4.4731080676512658E-2]
["1219","CLP",1.9801574762526564E-3,1.9801574762526564E-3,2.1282884829547929E-5,2.1282884829547929E-5,0]
["1219","CZK",3.1346719583062381E-3,3.1346719583062381E-3,3.369169526521673E-5,3.369169526521673E-5,0]
["1219","HUF",2.7909473131664435E-3,2.8457902435668923E-3,2.9997316346711933E-5,3.0586772380095986E-5,-1.9650292265183333E-2]
["1219","MYR",9.0704059479084914E-3,9.0704059479084914E-3,9.7489420645427305E-5,9.7489420645427305E-5,0]
["1219","PLN",7.2574893085479613E-3,7.2574893085479613E-3,7.8004053191673268E-5,7.8004053191673268E-5,0]
["1219","RON",-4.2474995169713367E-5,-4.2474995169713367E-5,-4.5652451442567506E-7,-4.5652451442567506E-7,0]
["1219","TRL",2.8739175025435902E-3,2.8739175025435902E-3,3.0889086322573325E-5,3.0889086322573325E-5,0]
["1232","CAD",7.2757100496008782,50.191463446924743,0.12569075748457961,0.8670773047435596]
["1232","USD",49.97650783464838,7.0607511891836978,0.86336386185642044,0.12197725848452812,0.8587185960942928]
["1232","EUR",0.42462225029912321,0.42462225029912321,7.3355166603747933E-3,7.3355166603747933E-3,0]
["1232","GBP",0.20892787586340036,0.20892787586340036,3.6093113658859405E-3,3.6093113658859405E-3,0]
["1234","CAD",28.904499999999999,28.904499999999999,1,1]
["1237","CAD",47.88014721405689,47.88014721405689,0.37680905735111359,0.37680905735111359]
["1237","AUD",2.4800450659778734,2.4800450659778734,1.9517555769441048E-2,1.9517555769441048E-2,0]
["1237","EUR",19.643129474499226,19.643129474499226,0.15458826948925708,0.15458826948925708,0]
["1237","GBP",8.1134384119830489,8.1134384119830489,6.3851455306263044E-2,6.3851455306263044E-2,0]
["1237","HKD",1.8931085764625717,1.8931085764625717,1.4898460002034918E-2,1.4898460002034918E-2,0]
["1237","JPY",5.4246918507103086,5.4246918507103086,4.2691452337187262E-2,4.2691452337187262E-2,0]
["1237","MXN",0.23863266932106014,0.23863266932106014,1.8780007249779263E-3,1.8780007249779263E-3,0]
["1237","NOK",0.58045284682375464,0.58045284682375464,4.5680705422772062E-3,4.5680705422772062E-3,0]
["1237","NZD",0.18610487877932561,0.18610487877932561,1.4646154621824764E-3,1.4646154621824764E-3,0]
["1237","SGD",6.0472784655276883E-2,6.0472784655276883E-2,4.7591108856620095E-4,4.7591108856620095E-4,0]
["1237","USD",35.773782665015759,35.773782665015759,0.28153391558350732,0.28153391558350732,0]
["1237","CHF",1.3780366840926817,1.3780366840926817,1.0844927055190251E-2,1.0844927055190251E-2,0]
["1237","KOR",1.3038922082161952,1.3038922082161952,1.0261421955719526E-2,1.0261421955719526E-2,0]
["1237","SEK",2.1114365406458631,2.1114365406458631,1.6616665963463981E-2,1.6616665963463981E-2,0]
["1238","AUD",2.7987410000000001,2.7987410000000001,5.7148536645627912E-2,5.7148536645627912E-2,0]
["1238","CAD",4.7458,4.7458,9.6906260783981416E-2,9.6906260783981416E-2]
["1238","EUR",13.07845,13.07845,0.26705374991577008,0.26705374991577008,0]
["1238","GBP",0.91264800000000001,0.91264800000000001,1.8635700006738393E-2,1.8635700006738393E-2,0]
["1238","HKD",5.8672469999999999,5.8672469999999999,0.11980550547137102,0.11980550547137102,0]
["1238","JPY",1.2687520000000001,1.2687520000000001,2.5907120439588267E-2,2.5907120439588267E-2,0]
["1238","MXN",1.018327,1.018327,2.0793598934925498E-2,2.0793598934925498E-2,0]
["1238","NOK",9.0000000000000002E-6,9.0000000000000002E-6,1.8377435775966808E-7,1.8377435775966808E-7,0]
["1238","NZD",0.79417300000000002,0.79417300000000002,1.6216514780563209E-2,1.6216514780563209E-2,0]
["1238","SGD",0.25805800000000001,0.25805800000000001,5.2693825794160468E-3,5.2693825794160468E-3,0]
["1238","USD",18.230848000000002,18.230848000000002,0.37226248695712549,0.37226248695712549,0]
["1240","CAD",4.0000000000000001E-3,4.0000000000000001E-3,6.6312997347480103E-4,6.6312997347480103E-4]
["1240","USD",6.0280265899999996,6.0280265899999996,0.99934127818302376,0.99934127818302376,0]
["1241","AUD",6.9427000000000003E-2,6.9427000000000003E-2,1.5198555166374781E-2,1.5198555166374781E-2,0]
["1241","CAD",0.34350000000000003,0.34350000000000003,7.5197022767075308E-2,7.5197022767075308E-2]
["1241","CHF",0.12353500000000001,0.12353500000000001,2.7043563922942208E-2,2.7043563922942208E-2,0]
["1241","DKK",1.4416999999999999E-2,1.4416999999999999E-2,3.1560858143607705E-3,3.1560858143607705E-3,0]
["1241","EUR",0.35158600000000001,0.35158600000000001,7.6967162872154118E-2,7.6967162872154118E-2,0]
["1241","GBP",0.15380099999999999,0.15380099999999999,3.3669220665499121E-2,3.3669220665499121E-2,0]
["1241","HKD",0.124748,0.124748,2.7309106830122592E-2,2.7309106830122592E-2,0]
["1241","ILS",1.4822E-2,1.4822E-2,3.2447460595446584E-3,3.2447460595446584E-3,0]
["1241","JPY",0.46307700000000002,0.46307700000000002,0.10137412434325745,0.10137412434325745,0]
["1241","NOK",4.9568000000000001E-2,4.9568000000000001E-2,1.0851138353765324E-2,1.0851138353765324E-2,0]
["1241","NZD",3.6631999999999998E-2,3.6631999999999998E-2,8.0192644483362517E-3,8.0192644483362517E-3,0]
["1241","SEK",-4.5000000000000003E-5,-4.5000000000000003E-5,-9.8511383537653249E-6,-9.8511383537653249E-6,0]
["1241","SGD",7.9762E-2,7.9762E-2,1.7461033274956218E-2,1.7461033274956218E-2,0]
["1241","USD",2.7430850000000002,2.7430850000000002,0.6005002189141857,0.6005002189141857,0]
["1259","AUD",0.13810800000000001,0.13810800000000001,5.5256019396499991E-3,5.5256019396499991E-3,0]
["1259","CAD",16.059853406425514,16.059853406425514,0.64254320628087769,0.64254320628087769]
["1259","CHF",0.25727100000000003,0.25727100000000003,1.0293228028902706E-2,1.0293228028902706E-2,0]
["1259","EUR",0.97817533716164051,0.97817533716164051,3.9136093060055555E-2,3.9136093060055555E-2,0]
["1259","GBP",1.1307388341426192,1.1307388341426192,4.5240049057086014E-2,4.5240049057086014E-2,0]
["1259","HKD",0.10081,0.10081,4.0333357338902627E-3,4.0333357338902627E-3,0]
["1259","ILS",0.10054100000000001,0.10054100000000001,4.0225732369909822E-3,4.0225732369909822E-3,0]
["1259","JPY",0.32135000000000002,0.32135000000000002,1.2856982820014243E-2,1.2856982820014243E-2,0]
["1259","KOR",8.029E-2,8.029E-2,3.2123452641012714E-3,3.2123452641012714E-3,0]
["1259","SEK",8.3204E-2,8.3204E-2,3.3289323122964527E-3,3.3289323122964527E-3,0]
["1259","SGD",0.109001,0.109001,4.3610517640092503E-3,4.3610517640092503E-3,0]
["1259","THB",6.8487999999999993E-2,6.8487999999999993E-2,2.7401557161261408E-3,2.7401557161261408E-3,0]
["1259","USD",5.5663666554531881,5.5663666554531881,0.22270633408763585,0.22270633408763585,0]
["1260","CAD",15.436621082017055,19.10381054361493,0.78673175351237723,0.97363110021889232]
["1260","USD",4.1542183308333582,0.51108949111748481,0.21172091058820858,2.604782027182256E-2,0.87697096049957546]
["1260","EUR",1.1112376689279585E-2,-9.3413448050968324E-5,5.6634541665543314E-4,-4.7608427645082019E-6,1.0084062528352811]
["1260","BRL",1.031529353960041E-3,1.031529353960041E-3,5.2572184879622093E-5,5.2572184879622093E-5,0]
["1260","GBP",5.9175261316079166E-3,1.3576131121998655E-4,3.0158839070025875E-4,6.9191135720540306E-6,0.97705775890116819]
["1260","MXN",7.1615604565375924E-3,1.4484800078699142E-4,3.6499095144729133E-4,7.3822192723682254E-6,0.97977424031172378]
["1260","RUB",4.4857969703737191E-3,4.4857969703737191E-3,2.2861990960663565E-4,2.2861990960663565E-4,0]
["1260","ZAR",6.4544245670707405E-4,6.4544245670707405E-4,3.2895157111036741E-5,3.2895157111036741E-5,0]
["1261","AUD",0.209008,-4.6555499999999883E-3,1.4104817049304235E-2,-3.1417783536461842E-4,1.0222745062389955]
["1261","BRL",0.18200588469354337,0.18210784653413745,1.2282590644851829E-2,1.2289471496817255E-2,-5.6021177977716441E-4]
["1261","CAD",3.2113516436773542,13.002393428363035,0.2167167161785746,0.87746105656308027]
["1261","CLP",2.3668565745796882E-2,2.3668565745796882E-2,1.597263213197074E-3,1.597263213197074E-3,0]
["1261","EUR",0.70544200000000001,0.15611131000000006,4.7606456924592734E-2,1.0535106153243988E-2,0.77870425917368113]
["1261","JPY",0.75740300000000005,0.23406540999999997,5.11130231742047E-2,1.5795805833367073E-2,0.69096318604494567]
["1261","MXN",0.51971563112285912,2.8824621122859089E-2,3.5072790968056787E-2,1.9452174436071243E-3,0.94453770601322351]
["1261","NOK",0.14410700000000001,9.147900000000082E-4,9.7250003374228997E-3,6.1734218731020521E-5,0.99365200857696012]
["1261","NZD",6.7805000000000004E-2,1.91179999999993E-4,4.5757919315436426E-3,1.2901701961101416E-5,0.997180443920065]
["1261","RUB",0.26063090227753133,0.26063090227753133,1.7588566916193014E-2,1.7588566916193014E-2,0]
["1261","SEK",0.114812,0.114812,7.7480395729575789E-3,7.7480395729575789E-3,0]
["1261","USD",8.4143107826167363,0.61121312974355502,0.56783622724870342,4.1247461212802837E-2,0.92736028588268093]
["1261","ZAR",9.4368463196012289E-2,9.4525367812115346E-2,6.3684160826559429E-3,6.3790047247381833E-3,-1.662680632799507E-3]
["1261","COP",8.3980034054516144E-3,8.3980034054516144E-3,5.6673573075350682E-4,5.6673573075350682E-4,0]
["1261","CZK",6.8412190049463462E-3,6.8412190049463462E-3,4.616767896874348E-4,4.616767896874348E-4,0]
["1261","HUF",6.0910621763927818E-3,6.210753328364303E-3,4.110527713482597E-4,4.1913007844166655E-4,-1.9650292265183333E-2]
["1261","IDR",1.9818110527681256E-2,1.9908985540453294E-2,1.337416860865777E-3,1.3435495229146114E-3,-4.5854529191926563E-3]
["1261","MYR",1.9795574905049695E-2,1.9795574905049695E-2,1.3358960538425513E-3,1.3358960538425513E-3,0]
["1261","PEN",-9.2143557627284437E-5,-4.9455248338954507E-4,-6.2182692653145754E-6,-3.3374666517495048E-5,-4.367195451579831]
["1261","PHP",1.0718926682936164E-2,1.0718926682936164E-2,7.2336226282113645E-4,7.2336226282113645E-4,0]
["1261","PLN",1.5839001479651074E-2,1.5839001479651074E-2,1.0688883588864419E-3,1.0688883588864419E-3,0]
["1261","RON",-9.269893247364146E-5,-9.269893247364146E-5,-6.2557485034377631E-6,-6.2557485034377631E-6,0]
["1261","THB",2.000352270641324E-2,2.000352270641324E-2,1.3499293238323979E-3,1.3499293238323979E-3,0]
["1261","TRL",6.2721392536629764E-3,6.2721392536629764E-3,4.2327268181445633E-4,4.2327268181445633E-4,0]
["1262","BRL",0.635629,0.635629,2.8911413938340898E-2,2.8911413938340898E-2,0]
["1262","CAD",0.75109999999999999,19.193200000000001,3.4163581285762371E-2,0.87299753472759201]
["1262","EUR",0.87653999999999999,5.1872819999999834E-2,3.986918591428857E-2,2.3594212522856E-3,0.94082093230200581]
["1262","EGP",1.3817870000000001,1.3817870000000001,6.2850209684608888E-2,6.2850209684608888E-2,0]
["1262","JPY",0.159466,1.2435070000000006E-2,7.2532680779062468E-3,5.6560581112920423E-4,0.92202055610600375]
["1262","MXN",0.629714,0.629714,2.8642371755801577E-2,2.8642371755801577E-2,0]
["1262","USD",17.551149819999999,8.0723090000003578E-2,0.79830932436980906,3.6716680160471756E-3,0.9954006950639771]
["1263","CAD",17.535900000000002,17.535900000000002,1,1]
["1264","CAD",0.13900000000000001,0.13900000000000001,8.6714037068691251E-3,8.6714037068691251E-3]
["1264","USD",15.890707000000001,15.890707000000001,0.99132903298252628,0.99132903298252628,0]
["1265","AUD",0.28349299999999999,0.28349299999999999,3.4695868213638813E-2,3.4695868213638813E-2,0]
["1265","CAD",0.8256,0.8256,0.10104273755323837,0.10104273755323837]
["1265","CHF",0.56343900000000002,0.56343900000000002,6.895762960787194E-2,6.895762960787194E-2,0]
["1265","EUR",2.036279,2.036279,0.24921415283693152,0.24921415283693152,0]
["1265","GBP",2.3241420000000002,2.3241420000000002,0.28444485240123368,0.28444485240123368,0]
["1265","HKD",0.21138899999999999,0.21138899999999999,2.5871273314730502E-2,2.5871273314730502E-2,0]
["1265","ILS",0.22384699999999999,0.22384699999999999,2.7395971018749694E-2,2.7395971018749694E-2,0]
["1265","JPY",0.68779299999999999,0.68779299999999999,8.4176947177754924E-2,8.4176947177754924E-2,0]
["1265","KOR",0.17333699999999999,0.17333699999999999,2.1214201791746216E-2,2.1214201791746216E-2,0]
["1265","SGD",0.23960799999999999,0.23960799999999999,2.9324913105203895E-2,2.9324913105203895E-2,0]
["1265","SEK",0.17665500000000001,0.17665500000000001,2.1620281979732706E-2,2.1620281979732706E-2,0]
["1265","THB",0.14610200000000001,0.14610200000000001,1.7880990845449651E-2,1.7880990845449651E-2,0]
["1265","USD",0.27913900000000003,0.27913900000000003,3.4162995055563715E-2,3.4162995055563715E-2,0]
["1266","CAD",0.11260000000000001,0.11260000000000001,1.0344985989250771E-2,1.0344985989250771E-2]
["1266","CHF",0.44705600000000001,0.44705600000000001,4.1072718085350728E-2,4.1072718085350728E-2,0]
["1266","DKK",0.409636,0.409636,3.7634801782351048E-2,3.7634801782351048E-2,0]
["1266","EUR",4.15918046,4.15918046,0.38211957003077773,0.38211957003077773,0]
["1266","GBP",0.40890417000000001,0.40890417000000001,3.75675658045845E-2,3.75675658045845E-2,0]
["1266","HKD",0.96542454,0.96542454,8.8697187744039688E-2,8.8697187744039688E-2,0]
["1266","IDR",0.29202400000000001,0.29202400000000001,2.6829344480683543E-2,2.6829344480683543E-2,0]
["1266","JPY",2.0132833799999998,2.0132833799999998,0.18496792503100737,0.18496792503100737,0]
["1266","SEK",0.66997499999999999,0.66997499999999999,6.1553126004869306E-2,6.1553126004869306E-2,0]
["1266","USD",1.406461,1.406461,0.12921686802333593,0.12921686802333593,0]
["1266","ZAR",6.0000000000000002E-6,6.0000000000000002E-6,5.5124259267766091E-7,5.5124259267766091E-7,0]
["1268","CAD",0.49880000000000002,0.49880000000000002,6.7305356901902577E-2,6.7305356901902577E-2]
["1268","CHF",0.167823,0.167823,2.2645122115773849E-2,2.2645122115773849E-2,0]
["1268","GBP",0.27515299999999998,0.27515299999999998,3.7127648090676021E-2,3.7127648090676021E-2,0]
["1268","HKD",0.88862114000000003,0.88862114000000003,0.1199056996356767,0.1199056996356767,0]
["1268","IDR",0.31348999999999999,0.31348999999999999,4.2300634192416676E-2,4.2300634192416676E-2,0]
["1268","INR",0.90225632,0.90225632,0.12174555660504656,0.12174555660504656,0]
["1268","KOR",0.88124599999999997,0.88124599999999997,0.1189105383888814,0.1189105383888814,0]
["1268","MYR",0.66708999999999996,0.66708999999999996,9.0013493455673999E-2,9.0013493455673999E-2,0]
["1268","MXN",2.6999999999999999E-5,2.6999999999999999E-5,3.6432330319794896E-6,3.6432330319794896E-6,0]
["1268","NTD",0.30079699999999998,0.30079699999999998,4.0587909863716097E-2,4.0587909863716097E-2,0]
["1268","THB",0.22587599999999999,0.22587599999999999,3.0478477938199973E-2,3.0478477938199973E-2,0]
["1268","USD",2.2898999999999998,2.2898999999999998,0.30898664147888272,0.30898664147888272,0]
["2167","CAD",3.7028962029638235E-2,3.7028962029638235E-2,8.9254373730658365E-3,8.9254373730658365E-3]
["2167","AED",1.6247452326207553E-2,1.6247452326207553E-2,3.9162755384114425E-3,3.9162755384114425E-3,0]
["2167","BRL",0.26733308959265545,0.26733308959265545,6.4437797284126463E-2,6.4437797284126463E-2,0]
["2167","CNY",0.14978598739616156,0.14978598739616156,3.6104318797734604E-2,3.6104318797734604E-2,0]
["2167","COP",2.2218528136536221E-2,2.2218528136536221E-2,5.355539840561193E-3,5.355539840561193E-3,0]
["2167","EUR",3.4908383055204657E-3,3.4908383055204657E-3,8.4142943705750378E-4,8.4142943705750378E-4,0]
["2167","HKD",1.0233622707692918,1.0233622707692918,0.24667058856251156,0.24667058856251156,0]
["2167","IDR",4.1087846405339815E-2,4.1087846405339815E-2,9.9037882723117636E-3,9.9037882723117636E-3,0]
["2167","INR",0.25359615383978673,0.25359615383978673,6.1126655058159597E-2,6.1126655058159597E-2,0]
["2167","KOR",0.57645841824429622,0.57645841824429622,0.13894916919620512,0.13894916919620512,0]
["2167","MXN",7.6244945759928268E-2,7.6244945759928268E-2,1.8378033060941563E-2,1.8378033060941563E-2,0]
["2167","MYR",4.8333210348895657E-2,4.8333210348895657E-2,1.1650206172751863E-2,1.1650206172751863E-2,0]
["2167","NTD",0.60042955470995507,0.60042955470995507,0.14472715662977681,0.14472715662977681,0]
["2167","PKR",7.6394163217720591E-3,7.6394163217720591E-3,1.8414000341726467E-3,1.8414000341726467E-3,0]
["2167","PHP",8.9498869161003303E-2,8.9498869161003303E-2,2.1572750297925446E-2,2.1572750297925446E-2,0]
["2167","PLN",3.0823385722867871E-2,3.0823385722867871E-2,7.4296492209289348E-3,7.4296492209289348E-3,0]
["2167","RUB",0.19691062258980521,0.19691062258980521,4.7463210786464483E-2,4.7463210786464483E-2,0]
["2167","THB",0.1116057867053174,0.1116057867053174,2.6901387592575363E-2,2.6901387592575363E-2,0]
["2167","TRL",3.3027577707771164E-2,3.3027577707771164E-2,7.9609462500954912E-3,7.9609462500954912E-3,0]
["2167","USD",0.42123071783139193,0.42123071783139193,0.10153318336620916,0.10153318336620916,0]
["2167","ZAR",0.14239559049098729,0.14239559049098729,3.4322942244796512E-2,3.4322942244796512E-2,0]
["1292","CAD",413.2747,413.2747,0.92835587611339887,0.92835587611339887]
["1292","USD",31.893691,31.893691,7.1644103669532694E-2,7.1644103669532694E-2,0]
["1360","AUD",3.0099589999999998,3.0099589999999998,2.2380624509720087E-2,2.2380624509720087E-2,0]
["1360","CAD",1.5158,1.5158,1.1270768349945535E-2,1.1270768349945535E-2]
["1360","CHF",13.962406,13.962406,0.10381781477364403,0.10381781477364403,0]
["1360","EUR",42.973278000000001,42.973278000000001,0.31952887028355376,0.31952887028355376,0]
["1360","GBP",28.065850999999999,28.065850999999999,0.20868432851635257,0.20868432851635257,0]
["1360","HKD",6.1262489999999996,6.1262489999999996,4.5551875796995302E-2,4.5551875796995302E-2,0]
["1360","INR",-0.34767100000000001,-0.34767100000000001,-2.5851163101952199E-3,-2.5851163101952199E-3,0]
["1360","JPY",25.704160340000001,25.704160340000001,0.19112391926507274,0.19112391926507274,0]
["1360","KOR",2.5973609999999998,2.5973609999999998,1.9312741886913103E-2,1.9312741886913103E-2,0]
["1360","SEK",2.5959210000000001,2.5959210000000001,1.9302034731335904E-2,1.9302034731335904E-2,0]
["1360","USD",8.28613,8.28613,6.1611724335357033E-2,6.1611724335357033E-2,0]
["1537","CAD",6.4306999999999999,6.4306999999999999,7.2943230482096595E-3,7.2943230482096595E-3]
["1537","CHF",9.8401350000000001,9.8401350000000001,1.116163458534756E-2,1.116163458534756E-2,0]
["1537","EUR",8.9403410000000001,8.9403410000000001,1.0141001044233723E-2,1.0141001044233723E-2,0]
["1537","GBP",3.8999999999999999E-5,3.8999999999999999E-5,4.4237578938556723E-8,4.4237578938556723E-8,0]
["1537","HKD",4.892614,4.892614,5.5496768728432759E-3,5.5496768728432759E-3,0]
["1537","USD",851.49950081000009,851.49950081000009,0.96585324059548783,0.96585324059548783,0]
["1870","CAD",197.94851249100643,247.95127192015096,0.80262759620658364,1.005375240527143]
["1870","EUR",7.0213918506233641,-2.4816834973880515,2.8469841941077344E-2,-1.0062554322779353E-2,1.3534460902032872]
["1870","GBP",1.8457027234026786,-1.4281446111050524,7.4838245640463869E-3,-5.7907395303044467E-3,1.773767407392763]
["1870","JPY",0.44901131030885871,-1.067814219327746,1.8206192313728125E-3,-4.329697400950047E-3,3.3781454827791197]
["1870","USD",37.850901537908463,2.1515680290084713,0.15347515236823939,8.7240255229322147E-3,0.94315675607214711]
["1870","NZD",0.37557658291406087,-0.13082629846806734,1.5228613043984927E-3,-5.3046520096886669E-4,1.3483345459213651]
["1870","AUD",0.87415527236332724,0.74987502919954252,3.5444628309604809E-3,3.0405401110004094E-3,0.14217181671602364]
["1870","BRL",1.9708112465641619E-2,0.30069180704459308,7.9911057350257303E-5,1.2192238236606139E-3,-14.257260560533529]
["1870","CHF",5.7046227594277441E-3,4.8982015630372831E-3,2.3130699973675661E-5,1.9860880472413582E-5,0.14136275620639926]
["1870","CLP",8.2272106755680379E-4,8.2272106755680379E-4,3.3359110633965161E-6,3.3359110633965161E-6,0]
["1870","DKK",4.2951017905578648E-3,3.716612457248449E-3,1.7415474267707265E-5,1.5069856727154233E-5,0.13468582620815595]
["1870","HKD",6.7567489519729559E-2,3.5703461395894413E-2,2.7396786675726103E-4,1.4476786430887311E-4,0.47158816096801881]
["1870","IDR",5.6388363211041428E-3,0.17154427021861418,2.2863953787052692E-5,6.9556554639345705E-4,-29.421927583992016]
["1870","ILS",1.0436849039060639E-3,-0.48653522245136355,4.2318595632653865E-6,-1.9727685303203056E-3,467.17060439455565]
["1870","KOR",2.2262703247485201E-2,-0.70549838349882299,9.0269230961770392E-5,-2.8606048337999905E-3,32.68969983815942]
["1870","MXN",3.3995326538138547E-2,0.36113352703045642,1.3784184017449344E-4,1.4642986252459455E-3,-9.6230345110910864]
["1870","MYR",7.4024235926309521E-3,7.4024235926309521E-3,3.0014822437861081E-5,3.0014822437861081E-5,0]
["1870","NOK",5.3946661732354878E-3,2.7622568086898353E-2,2.187390998029194E-5,1.120020309606884E-4,-4.1203479881557765]
["1870","NTD",1.4821249328310099E-2,3.0869151962390904E-2,6.0096151122633256E-5,1.2516604911408591E-4,-1.0827631516479297]
["1870","PHP",4.0501136562806437E-3,9.4887461015805714E-3,1.6422113747642757E-5,3.8474295051205437E-5,-1.3428345243758932]
["1870","PLN",3.7936322143477179E-3,-0.16582001250322698,1.5382150978437427E-5,-6.723552319922464E-4,44.710091841820329]
["1870","SEK",1.5359931531448157E-2,0.33624918331770659,6.2280361533628942E-5,1.3633993523693671E-3,-20.891320454734117]
["1870","SGD",1.0593664799823581E-3,-0.1952878157124868,4.295444106298608E-6,-7.9183919152142678E-4,185.34396349386]
["1870","THB",5.5852502408623751E-3,1.6150501048169098E-2,2.2646676747516783E-5,6.5485906767866347E-5,-1.8916342780866029]
["1870","TRL",1.886657490781474E-3,0.26281675875953553,7.6498850515983503E-6,1.0656507627737572E-3,-138.30284645925531]
["1870","ZAR",2.651018636759564E-2,0.2994501779810872,1.0749162442015606E-4,1.2141893541509365E-3,-10.295664761795715]
["1870","COP",1.0553263437597935E-3,3.7318925505849879E-3,4.2790624483419137E-6,1.5131813366434741E-5,-2.5362450417843609]
["1870","INR",8.1586225044244715E-5,0.5409138826297456,3.3081004179713993E-7,2.193259266798522E-3,-6628.9658102382436]
["1870","AED",4.4463473555812327E-4,4.4463473555812327E-4,1.8028734063216604E-6,1.8028734063216604E-6,0]
["1870","CZK",2.2405611650995184E-4,2.2405611650995184E-4,9.0848685825782819E-7,9.0848685825782819E-7,0]
["1870","HUF",9.6728412163575735E-4,9.7105597105447995E-4,3.9220750872405676E-6,3.9373689148834506E-6,-3.8994224492634455E-3]
["1870","QAR",8.7015912759554244E-4,8.7015912759554244E-4,3.5282595464361463E-6,3.5282595464361463E-6,0]
["1870","RUB",9.9271151764153132E-3,9.9271151764153132E-3,4.0251762900588234E-5,4.0251762900588234E-5,0]
["1870","PEN",-2.9037369809775244E-6,8.9501477056839994E-3,-1.1773866869366053E-8,3.6290424455871567E-5,3083.2859523147958]
["1870","CNY",1.3303756830256882E-7,1.3303756830256882E-7,5.3943130114054999E-10,5.3943130114054999E-10,0]
["1870","NGN",1.2295868297175602E-8,1.2295868297175602E-8,4.9856415137664549E-11,4.9856415137664549E-11,0]
["1870","RON",-2.9212386112726629E-6,-2.9212386112726629E-6,-1.1844831239225218E-8,-1.1844831239225218E-8,0]
["2238","BRL",4.5856040629476604,4.6005773792938989,2.0531441598419221E-3,2.0598482661249194E-3,-3.2652876569141398E-3]
["2238","CAD",980.76591460454915,1657.5462039121317,0.43912509281230006,0.74214460330941667]
["2238","CHF",33.523708591132184,33.516383611673888,1.5009801449338764E-2,1.5006521785724262E-2,2.185014655637918E-4]
["2238","CNY",5.5942164481235732,5.5942164481235732,2.5047371451370841E-3,2.5047371451370841E-3,0]
["2238","DKK",8.9165890387564488,8.9165890387564488,3.9922859582572417E-3,3.9922859582572417E-3,0]
["2238","EUR",107.24837544157126,101.14934139576947,4.8019055432546871E-2,4.5288292819831107E-2,5.6868311717453768E-2]
["2238","GBP",20.952265384663313,18.391964843362985,9.3811024064574915E-3,8.234761372288079E-3,0.12219683620342192]
["2238","HKD",15.398338031495582,15.398338031495582,6.8944041759057915E-3,6.8944041759057915E-3,0]
["2238","JPY",29.322600575485417,29.003563040851635,1.3128810358789676E-2,1.2985965481209326E-2,1.0880260562581512E-2]
["2238","NOK",4.4274195214103198,4.3274577518428492,1.9823191031696952E-3,1.9375625300819199E-3,2.2577885173083567E-2]
["2238","NTD",4.9288069999999999,5.0620097600733951,2.2068087798520182E-3,2.2664485710693436E-3,-2.7025355237767501E-2]
["2238","SEK",5.4011505721865269,5.3951889230707648,2.4182944278410539E-3,2.4156251775313822E-3,1.1037739155915771E-3]
["2238","USD",1006.9884642980734,341.76425585420179,0.45086589599119808,0.15302046934656685,0.66060757598407016]
["2238","AUD",0.21974219285088314,3.9815707875482102E-2,9.8386688804667007E-5,1.7826961720277761E-5,0.81880717872647701]
["2238","CLP",2.0947563842703368E-2,2.0947563842703368E-2,9.3789973526227497E-6,9.3789973526227497E-6,0]
["2238","COP",8.28470565314216E-3,3.0477125713656281E-2,3.7093684483575376E-6,1.3645733868165338E-5,-2.6787216093908115]
["2238","IDR",1.9550743718047783E-2,6.5706467306368699E-2,8.7535894364751039E-6,2.9419210154658938E-5,-2.3608167675848262]
["2238","INR",0,1.4223239876775524E-2,0,6.3682693678225927E-6]
["2238","KOR",0,6.2293161255093911E-2,0,2.789094707552534E-5]
["2238","MXN",1.9701329443191,4.0002119129211679E-2,8.8210122226313546E-4,1.7910424917638428E-5,0.97969572599424914]
["2238","NZD",0.79195094182600434,-5.3862316964001906E-2,3.545856617298469E-4,-2.4116146966057248E-5,1.0680121887850924]
["2238","PEN",-9.090044572735463E-5,7.3778236604158332E-2,-4.0699484017854238E-8,3.3033239138813143E-5,812.63778696363727]
["2238","PHP",1.0574317274995446E-2,5.5680929016886517E-2,4.7345120641568687E-6,2.4930406693705433E-5,-4.2656760307875761]
["2238","RUB",2.0871719102154018,2.0871719102154018,9.3450388634082392E-4,9.3450388634082392E-4,0]
["2238","THB",1.9733654494709905E-2,0.10742558340765364,8.8354853410758556E-6,4.8098397978402355E-5,-4.4437754262116895]
["2238","ZAR",0.19909055949482651,0.19062548343207961,8.9140190451529917E-5,8.5350063514649433E-5,4.2518721551771388E-2]
["2238","CZK",6.7489238844402047E-3,6.7489238844402047E-3,3.0217422761198872E-6,3.0217422761198872E-6,0]
["2238","HUF",6.0088874474191721E-3,6.12696384194955E-3,2.6904006539731039E-6,2.7432678131341159E-6,-1.9650292265183333E-2]
["2238","MYR",1.9528512124274963E-2,1.9528512124274963E-2,8.7436355315386832E-6,8.7436355315386832E-6,0]
["2238","PLN",1.5625316966817265E-2,1.5625316966817265E-2,6.9960310213694819E-6,6.9960310213694819E-6,0]
["2238","RON",-9.1448327992589234E-5,-9.1448327992589234E-5,-4.0944791126297506E-8,-4.0944791126297506E-8,0]
["2238","TRL",6.1875216076221788E-3,6.1875216076221788E-3,2.7703817595667067E-6,2.7703817595667067E-6,0]
["2309","AUD",4.9372027815724824,1.8884331606557392,3.3487257028609794E-3,1.2808557685387895E-3,0.61750949997352955]
["2309","BRL",14.726656361601192,15.442231279623638,9.9885572574331723E-3,1.0473905789044669E-2,-4.8590453966744329E-2]
["2309","CAD",164.28395931559712,567.31211013438099,0.11142785529920833,0.38478724265528935]
["2309","CHF",61.57947336664666,61.248331626404713,4.1767124899385784E-2,4.1542523458874332E-2,5.3774695062803746E-3]
["2309","CLP",1.00652166431019,1.00652166431019,6.8268716455037524E-4,6.8268716455037524E-4,0]
["2309","CNY",9.731687568852232,9.731687568852232,6.600650962861351E-3,6.600650962861351E-3,0]
["2309","COP",0.37691753804311734,1.4349748751142577,2.5564950506287763E-4,9.7329144858910471E-4,-2.8071321450425697]
["2309","DKK",13.169646999151341,13.169646999151341,8.932494239099871E-3,8.932494239099871E-3,0]
["2309","EUR",172.31904332580598,170.44108223669429,0.1168777615599076,0.11560400861794758,1.0898163388482929E-2]
["2309","GBP",32.453372179538938,33.965344143974221,2.2011946110004031E-2,2.3037461893598607E-2,-4.658905570954941E-2]
["2309","HKD",30.496967061397225,30.496967061397225,2.0684987426276783E-2,2.0684987426276783E-2,0]
["2309","IDR",0.88947254104599927,3.0874737443270246,6.0329698656637538E-4,2.0941215384399029E-3,-2.4711287890868743]
["2309","INR",0,0.67721029221522511,0,4.5932719641319548E-4]
["2309","JPY",64.015180729068419,56.527301784996652,4.3419176923587155E-2,3.834042002635913E-2,0.11697036326059485]
["2309","KOR",0,2.9679292128574746,0,2.0130388155137333E-3]
["2309","MXN",22.076214770129052,0.46040913505808984,1.4973496348688515E-2,3.1227882925034822E-4,0.97914456169899822]
["2309","NOK",12.339808,7.0023703144842768,8.3696445226437328E-3,4.7494539905439705E-3,0.43253814690761172]
["2309","NTD",9.3048140000000004,15.649512605129544,6.31111809270604E-3,1.0614497199435077E-2,-0.68187269569596376]
["2309","NZD",5.6629480000000001,-2.3957724053540073,3.8409723806250703E-3,-1.624965590224108E-3,1.4230609932060134]
["2309","PEN",-4.1355690407156335E-3,3.5164856336983483,-2.8050065908351734E-6,2.3851047539020674E-3,851.30272716468619]
["2309","PHP",0.48108476035795472,2.627804019220159,3.2630235652429348E-4,1.7823442241603105E-3,-4.4622474785210855]
["2309","RUB",12.354289780929733,12.354289780929733,8.3794669897709912E-3,8.3794669897709912E-3,0]
["2309","SEK",11.992948999999999,11.722880479554052,8.1343826344944456E-3,7.9512049454340556E-3,2.2518941792043612E-2]
["2309","THB",0.89779417400526962,5.0746018600114242,6.0894124859354863E-4,3.4419185178766413E-3,-4.6522998332373211]
["2309","USD",821.55972805442741,441.64040453562387,0.55723418694483851,0.29954867959045611,0.46243664403866003]
["2309","ZAR",5.243886125278407,4.8399148106635588,3.556737899471685E-3,3.2827387982967433E-3,7.7036629889326691E-2]
["2309","CZK",0.3070462465976454,0.3070462465976454,2.0825834048911459E-4,2.0825834048911459E-4,0]
["2309","HUF",0.27337785527726371,0.27874981003229093,1.8542229093300656E-4,1.8906589314231998E-4,-1.9650292265183333E-2]
["2309","MYR",0.88846110166088998,0.88846110166088998,6.0261096389004477E-4,6.0261096389004477E-4,0]
["2309","PLN",0.71088295092806408,0.71088295092806408,4.8216614038694005E-4,4.8216614038694005E-4,0]
["2309","RON",-4.160495265399476E-3,-4.160495265399476E-3,-2.8219131456126312E-6,-2.8219131456126312E-6,0]
["2309","TRL",0.28150492106487929,0.28150492106487929,1.9093458509953506E-4,1.9093458509953506E-4,0]
["2421","BRL",21.918185999999999,21.918185999999999,8.7634195470096612E-3,8.7634195470096612E-3,0]
["2421","CAD",101.50020294718763,290.7578029471876,4.0582229867600891E-2,0.1162519842560405]
["2421","CHF",180.017085072079,146.39061658207899,7.1975173589473057E-2,5.8530500236387617E-2,0.18679598370641282]
["2421","CNY",28.291175368518672,28.291175368518672,1.1311494447230022E-2,1.1311494447230022E-2,0]
["2421","DKK",38.395873426341581,38.395873426341581,1.5351596510263698E-2,1.5351596510263698E-2,0]
["2421","EUR",486.61200332661394,344.10138866661401,0.19455921862155834,0.13758003676007557,0.29286292505272793]
["2421","GBP",89.714248453905114,76.593797893905105,3.5869920920747429E-2,3.0624048251217298E-2,0.14624712112191696]
["2421","HKD",89.843068685992634,89.843068685992634,3.5921426357370972E-2,3.5921426357370972E-2,0]
["2421","JPY",139.80037642985852,139.80037642985852,5.5895563231589097E-2,5.5895563231589097E-2,0]
["2421","NOK",21.771291000000002,21.771291000000002,8.7046873821143567E-3,8.7046873821143567E-3,0]
["2421","NTD",27.332888000000001,27.332888000000001,1.0928348038264929E-2,1.0928348038264929E-2,0]
["2421","SEK",23.127393999999999,23.127393999999999,9.2468900779924916E-3,9.2468900779924916E-3,0]
["2421","USD",1252.7759351251159,1252.7759351251159,0.50089004253813463,0.50089004253813463,0]
["2802","AUD",1.5063409999999999,1.5063409999999999,3.2293244607755914E-2,3.2293244607755914E-2,0]
["2802","CAD",2.2088999999999999,2.2088999999999999,4.7354847284958743E-2,4.7354847284958743E-2]
["2802","EUR",4.8182919999999996,4.8182919999999996,0.10329552348876744,0.10329552348876744,0]
["2802","GBP",2.4431669999999999,2.4431669999999999,5.2377110859093121E-2,5.2377110859093121E-2,0]
["2802","HKD",4.7314879999999997,4.7314879999999997,0.10143460168890164,0.10143460168890164,0]
["2802","ILS",1.9999999999999999E-6,1.9999999999999999E-6,4.2876406614114481E-8,4.2876406614114481E-8,0]
["2802","JPY",6.1727429999999996,6.1727429999999996,0.13233251939621443,0.13233251939621443,0]
["2802","NOK",1.9999999999999999E-6,1.9999999999999999E-6,4.2876406614114481E-8,4.2876406614114481E-8,0]
["2802","SEK",0.78588800000000003,0.78588800000000003,1.6848026720576604E-2,1.6848026720576604E-2,0]
["2802","SGD",0.76517800000000002,0.76517800000000002,1.6404041530087447E-2,1.6404041530087447E-2,0]
["2802","USD",23.213754999999999,23.213754999999999,0.49766119921021656,0.49766119921021656,0]
["2891","CAD",378.188712670781,477.21234930803672,0.45109451853798671,0.56920756156697971]
["2891","CHF",13.242991289262616,16.691203258124528,1.5795925630474831E-2,1.9908871008791153E-2,-0.26038014324284231]
["2891","EUR",42.267545608130099,39.605608629199843,5.041572499938584E-2,4.7240629763441268E-2,6.2978271878134207E-2]
["2891","GBP",15.505785876684582,23.749058315311093,1.8494933297189726E-2,2.8327312972456997E-2,-0.53162558184307085]
["2891","JPY",24.420070382557011,25.332898443323518,2.9127680236910428E-2,3.0216479877892534E-2,-3.7380238732585003E-2]
["2891","USD",266.83457677047522,151.38835800167334,0.31827394870546227,0.18057243957058305,0.43265089616967434]
["2891","BRL",5.7552908501632967,7.3571650922381711,6.8647742994923985E-3,8.7754518680643583E-3,-0.27833071929447728]
["2891","CNY",1.5014567380229826,1.5014567380229826,1.7909019535802284E-3,1.7909019535802284E-3,0]
["2891","DKK",2.4372484856114358,2.4076133553545644,2.9070921350616771E-3,2.8717440552085611E-3,1.2159256814323838E-2]
["2891","HKD",28.129251380523595,27.858910645903094,3.3551903277920438E-2,3.3229447267365209E-2,9.6106622591343172E-3]
["2891","NOK",1.3762547902729447,1.5147391681895046,1.6415640425107186E-3,1.8067449209672468E-3,-0.1006240842141557]
["2891","NTD",9.58341812342384,9.6755480895974397,1.1430873633971604E-2,1.1540764070522467E-2,-9.6134766308917374E-3]
["2891","SEK",6.7971163641844141,8.5903978566753079,8.107439040407222E-3,1.0246422633401061E-2,-0.26382974726460628]
["2891","NZD",1.0701105602071621,7.7699316860615444E-2,1.2764024725383091E-3,9.2677900623864258E-5,0.92739131847687428]
["2891","AUD",9.5738691563051432,13.659271213582253,1.1419483852678228E-2,1.629245444200883E-2,-0.42672424184808833]
["2891","CLP",4.9409186319269854E-2,4.9409186319269854E-2,5.8934104502074185E-5,5.8934104502074185E-5,0]
["2891","IDR",1.3145295545617355,2.2542784482011671,1.5679396466683438E-3,2.6888498180195181E-3,-0.71489369742831244]
["2891","ILS",0.32901858332282857,-2.3984820569399297,3.9244555551625453E-4,-2.8608524592302273E-3,8.2898072586573974]
["2891","KOR",9.8931544386080361,5.8187411092248551,1.1800319757799667E-2,6.9404562622362208E-3,0.41184167847241748]
["2891","MXN",2.0243811825228502,3.9634017364494869,2.4146338171188325E-3,4.727451502849765E-3,-0.95783371761545699]
["2891","MYR",2.2031666143918387,2.2031666143918387,2.6278848360109632E-3,2.6278848360109632E-3,0]
["2891","PHP",1.3483001409118514,1.3795303089831672,1.6082204003766446E-3,1.645471003469747E-3,-2.3162623160593032E-2]
["2891","PLN",0.86775894492878736,-0.10153197066837953,1.0350422695201858E-3,-1.2110492431522062E-4,1.1170048102203218]
["2891","SGD",0.5526034881608074,-0.73751033760466234,6.5913232225761934E-4,-8.7968482271487609E-4,2.3346103551739565]
["2891","THB",2.315110463489106,2.3757662362319412,2.7614088017454443E-3,2.8337575675474458E-3,-2.619994756164723E-2]
["2891","TRL",0.70237424905105916,2.1728954792556392,8.3777533039432368E-4,2.5917781446360959E-3,-2.093643427547812]
["2891","ZAR",4.4595723664346023,6.014134051179207,5.3192720515520316E-3,7.1735163249074902E-3,-0.3485898550374833]
["2891","COP",0.24991401982239916,0.26528225918541593,2.9809151005999327E-4,3.1642238114093811E-4,-6.1494106548876992E-2]
["2891","INR",3.2412487669360162,6.301424299221809,3.8660845842208775E-3,7.5161893127030062E-3,-0.94413473087985356]
["2891","AED",0.20691682717064597,0.20691682717064597,2.4680547938828466E-4,2.4680547938828466E-4,0]
["2891","CZK",1.7478720192137204E-3,1.7478720192137204E-3,2.0848202512579857E-6,2.0848202512579857E-6,0]
["2891","HUF",0.14847489323841009,0.14847712573470384,1.7709732796457989E-4,1.7709999083316118E-4,-1.503618723042166E-5]
["2891","QAR",0.16650591675276591,0.16650591675276591,1.9860430476860725E-4,1.9860430476860725E-4,0]
["2891","RUB",1.206824270219907,1.206824270219907,1.4394713403535855E-3,1.4394713403535855E-3,0]
["2891","PKR",0.24603691529536617,0.24603691529536617,2.9346699181990007E-4,2.9346699181990007E-4,0]
["2891","EGP",0.10155734744280555,0.10155734744280555,1.211351931293291E-4,1.211351931293291E-4,0]
["2891","MAD",1.6198497075295672E-2,1.6198497075295672E-2,1.932118277041332E-5,1.932118277041332E-5,0]
["2891","NGN",5.1451706260640759E-2,5.1451706260640759E-2,6.1370373800145517E-5,6.1370373800145517E-5,0]
["2891","PEN",-1.718674668153542E-6,5.1495272545301701E-2,-2.0499943440381131E-9,6.1422338630255939E-5,29963.199070883871]
["2891","RON",-1.7290335983309984E-6,-1.7290335983309984E-6,-2.0623502300400207E-9,-2.0623502300400207E-9,0]
["2898","CAD",1140.292514508717,1539.442997358804,0.50854278301283673,0.6865542097360533]
["2898","CHF",27.697841029551704,30.603545547336431,1.2352564786136444E-2,1.3648438470551411E-2,-0.10490725665890488]
["2898","EUR",95.487684956341994,55.77699205774536,4.2585189706408379E-2,2.4875184576083509E-2,0.41587240194118014]
["2898","GBP",34.509002386789781,33.968082020870611,1.5390177423321624E-2,1.5148940069947105E-2,1.5674761033551032E-2]
["2898","JPY",52.322638182079011,41.735778886787742,2.3334626595485526E-2,1.8613144325901106E-2,0.20233802543460755]
["2898","NOK",3.8104671268320427,4.197387049918027,1.699375846637886E-3,1.8719327405801686E-3,-0.10154133606387061]
["2898","NZD",3.2129914877234231,0.13075176476834402,1.4329162141938569E-3,5.8312113333289043E-5,0.95930528752785815]
["2898","USD",715.13435704105234,347.23044995259391,0.31893256469761055,0.1548563523121696,0.51445424690641572]
["2898","BRL",9.6338043712538148,14.159419497763441,4.2964429070810979E-3,6.3147574027013374E-3,-0.46976406745538157]
["2898","CNY",2.3630370943116481,2.3630370943116481,1.0538571857779447E-3,1.0538571857779447E-3,0]
["2898","DKK",4.7054940123294235,4.6365223903018054,2.0985361124739293E-3,2.067776443206131E-3,1.465767926744721E-2]
["2898","HKD",49.042312193670583,48.292593125645453,2.1871680828404631E-2,2.1537324322086993E-2,1.528718843973853E-2]
["2898","NTD",14.341814341149485,14.605271404137756,6.3961010755594306E-3,6.5135965307270612E-3,-1.83698559137222E-2]
["2898","SEK",14.177355038584917,19.257474085286173,6.3227562185561659E-3,8.5883660030411854E-3,-0.35832629096719848]
["2898","AUD",22.022730570962505,32.587101973484835,9.8216032742478691E-3,1.4533056489508681E-2,-0.47970306717785971]
["2898","CLP",8.1765346801381311E-2,8.1765346801381311E-2,3.6465359973268801E-5,3.6465359973268801E-5,0]
["2898","IDR",3.2821366419253635,5.9380070818282444,1.4637532745992354E-3,2.6482070245316728E-3,-0.80918947918783091]
["2898","ILS",0.6645502295770167,-7.040540183244496,2.9637327168329154E-4,-3.1399100258440687E-3,11.594443986161542]
["2898","KOR",14.136251108305226,2.6276714240759551,6.304424863372092E-3,1.1718776733517485E-3,0.8141182266823086]
["2898","MXN",3.5253638671873269,8.9890956350146709,1.5722267131822293E-3,4.0089184598115311E-3,-1.5498348464626783]
["2898","MYR",4.6615426378551872,4.6615426378551872,2.0789348662954457E-3,2.0789348662954457E-3,0]
["2898","PHP",3.1878809754836346,3.2771865325672063,1.4217175352454101E-3,1.4615456459801002E-3,-2.8014081382076395E-2]
["2898","PLN",1.2117155792894947,-1.5265100117069144,5.4039573624437801E-4,-6.8078641205923467E-4,2.2597923454958]
["2898","SGD",1.6503679348817704,-2.3953992570469547,7.3602403937687844E-4,-1.0682899248272031E-3,2.4514334691182409]
["2898","THB",3.3945341921818386,3.5679867147994884,1.5138798537742987E-3,1.5912354686277209E-3,-5.1097591833701106E-2]
["2898","TRL",1.045270332537201,5.1994468781450482,4.6616519633845054E-4,2.3188271008500734E-3,-3.9742604532976165]
["2898","ZAR",7.7487714032784725,12.140167499390998,3.4557639589972025E-3,5.4142200249750853E-3,-0.56672159592352211]
["2898","COP",0.94455292389448842,0.98850000945834704,4.2124767680963614E-4,4.4084701023819654E-4,-4.6526864140825852E-2]
["2898","INR",5.0301485189008037,13.675397930831931,2.2433241420266804E-3,6.0988955325638906E-3,-1.7186867106302262]
["2898","AED",0.28508106977999254,0.28508106977999254,1.2713923731460735E-4,1.2713923731460735E-4,0]
["2898","CZK",2.6183971697420288E-3,2.6183971697420288E-3,1.1677415810339139E-6,1.1677415810339139E-6,0]
["2898","HUF",0.19319848386095639,0.19320746696139268,8.6161834271832638E-5,8.6165840516579337E-5,-4.6496743953516884E-5]
["2898","QAR",0.21631366582145292,0.21631366582145292,9.6470644348608042E-5,9.6470644348608042E-5,0]
["2898","RUB",1.5729264803695813,1.5729264803695813,7.0148703041022912E-4,7.0148703041022912E-4,0]
["2898","PKR",0.40028876509269268,0.40028876509269268,1.7851907297375619E-4,1.7851907297375619E-4,0]
["2898","EGP",0.17121751327964743,0.17121751327964743,7.6358854939324972E-5,7.6358854939324972E-5,0]
["2898","MAD",2.7309362226713436E-2,2.7309362226713436E-2,1.2179312669663521E-5,1.2179312669663521E-5,0]
["2898","NGN",8.6743435327542598E-2,8.6743435327542598E-2,3.8685466622192152E-5,3.8685466622192152E-5,0]
["2898","PEN",-6.9155891566517668E-6,0.14724198828298032,-3.084184900935085E-9,6.5666352751628015E-5,21292.315164573571]
["2898","RON",-6.9572713356802701E-6,-6.9572713356802701E-6,-3.102774141025227E-9,-3.102774141025227E-9,0]
["2905","AUD",13.322701317767198,22.960935105651291,5.8372843053700269E-3,1.0060235002799003E-2,-0.72344440950804123]
["2905","CAD",1545.6228623071354,1945.7797175610817,0.67720801217200977,0.85253501794560738]
["2905","CHF",14.579732489195182,9.7085492042050632,6.3880471088978638E-3,4.2537590947896954E-3,0.3341064925985493]
["2905","EUR",59.640339462787388,-25.500222601429432,2.6131158329639352E-2,-1.117281290215945E-2,1.4275666911208698]
["2905","GBP",21.079200893878944,-12.721541664773278,9.235761247870039E-3,-5.5738887879186747E-3,1.6035115718484094]
["2905","JPY",30.803559963278691,5.4335415082349598,1.3496447367124952E-2,2.3806828519302202E-3,0.82360670277356407]
["2905","USD",502.19196999096073,236.31126892280042,0.22003325262585571,0.10353876652819237,0.52944036734188726]
["2905","BRL",6.4989525244431565,10.931391979998697,2.8474881082626289E-3,4.7895423997532261E-3,-0.68202367056609958]
["2905","CNY",1.503288164034049,1.503288164034049,6.5865924612915755E-4,6.5865924612915755E-4,0]
["2905","DKK",2.3931486992231781,2.2966894384094125,1.0485478139303772E-3,1.0062846035028576E-3,4.0306421763543709E-2]
["2905","HKD",25.992941523754652,25.267379517534902,1.1388695579677125E-2,1.1070793705990959E-2,2.7913809045300497E-2]
["2905","NOK",2.8861219614795552,3.2648504700984851,1.2645419293954296E-3,1.4304801972157264E-3,-0.1312240139792209]
["2905","NTD",9.5845211110559827,9.8361963469180758,4.1994167189984893E-3,4.3096871415883057E-3,-2.6258509209373004E-2]
["2905","SEK",7.565221341828428,12.519814808416886,3.314669206492911E-3,5.4855030330710122E-3,-0.65491718519778153]
["2905","NZD",3.2097534882973631,-0.3884871525495775,1.4063396915127248E-3,-1.7021397570410999E-4,1.1210333298074093]
["2905","CLP",6.6451899850805379E-2,6.6451899850805379E-2,2.9115614229362344E-5,2.9115614229362344E-5,0]
["2905","IDR",2.7329802512350545,5.3359427628635805,1.1974435474392418E-3,2.3379203812426584E-3,-0.95242638890355225]
["2905","ILS",0.42520247764143987,-7.1521824558691982,1.8630063754644009E-4,-3.1336979943482703E-3,17.820650941503715]
["2905","KOR",8.2418121499220316,-3.0769042653104455,3.6111145602572719E-3,-1.3481323756069064E-3,1.373328608968545]
["2905","MXN",2.1721279213235118,7.5083913720527544,9.5170851030703231E-4,3.289769399559328E-3,-2.456698520535463]
["2905","MYR",3.1103755894645988,3.1103755894645988,1.3627976923850009E-3,1.3627976923850009E-3,0]
["2905","PHP",2.6555474104694672,2.7408568963249511,1.1635166811573721E-3,1.2008946656220766E-3,-3.212500952502384E-2]
["2905","PLN",0.67222394191363677,-2.0087038102474342,2.9453203012165676E-4,-8.8010493863262707E-4,3.9881467841344755]
["2905","SGD",1.4832483008134474,-2.5046551496214118,6.4987886621450941E-4,-1.0974038857833953E-3,2.6886283626603866]
["2905","THB",2.1993919901057777,2.3650872698933982,9.636541448301908E-4,1.0362528193113411E-3,-7.5336856973663657E-2]
["2905","TRL",0.70702103622307255,4.7860116218228921,3.0977822739353193E-4,2.0969704160617958E-3,-5.7692633975785341]
["2905","ZAR",4.5986658225712596,8.9015210487994967,2.0148856595574869E-3,3.9001631780773522E-3,-0.93567469180058294]
["2905","COP",0.90402366544091917,0.9460047227206263,3.9609408243085651E-4,4.1448790219283439E-4,-4.643800697322642E-2]
["2905","INR",3.7769659697867466,12.25804857633959,1.6548614017151768E-3,5.3708112838727548E-3,-2.245474985582594]
["2905","AED",0.16037891983693103,0.16037891983693103,7.0269334224871196E-5,7.0269334224871196E-5,0]
["2905","CZK",1.6389942380119716E-3,1.6389942380119716E-3,7.181182790144997E-7,7.181182790144997E-7,0]
["2905","HUF",7.3788148980232615E-2,7.3802868492415019E-2,3.2329960245389905E-5,3.2336409536370436E-5,-1.9948341821596216E-4]
["2905","QAR",8.1971779130781616E-2,8.1971779130781616E-2,3.5915582612758159E-5,3.5915582612758159E-5,0]
["2905","RUB",0.85060431429250216,0.85060431429250216,3.7268862338586125E-4,3.7268862338586125E-4,0]
["2905","PKR",0.32012084004563696,0.32012084004563696,1.4025956980122687E-4,1.4025956980122687E-4,0]
["2905","EGP",0.14226567788492059,0.14226567788492059,6.2333095136118548E-5,6.2333095136118548E-5,0]
["2905","MAD",2.2691515928295297E-2,2.2691515928295297E-2,9.9421901485284559E-6,9.9421901485284559E-6,0]
["2905","NGN",7.2075650396719912E-2,7.2075650396719912E-2,3.1579636353404429E-5,3.1579636353404429E-5,0]
["2905","PEN",-1.1331733354427E-5,0.14062157998596878,-4.9649502518097827E-9,6.1612740710004934E-5,12410.53838108375]
["2905","RON",-1.140003286263711E-5,-1.140003286263711E-5,-4.9948753876985291E-9,-4.9948753876985291E-9,0]
["2912","CAD",1167.2440198552022,1496.2606147421454,0.68264511018916552,0.87506551744772965]
["2912","CHF",9.105564123826813,5.8871891204437299,5.32525223424606E-3,3.4430340164246982E-3,0.3534514676538778]
["2912","EUR",42.295389037078067,-9.5001275246842507,2.473582217477668E-2,-5.5560067051820946E-3,1.2246137874829808]
["2912","GBP",14.944519580092079,-4.2221797491766218,8.7400775175885195E-3,-2.4692783266284666E-3,1.2825236185444917]
["2912","JPY",18.910888130243034,3.8061999510596198,1.1059748511751781E-2,2.2259987978481229E-3,0.79872970931637022]
["2912","USD",379.18539561983334,132.09366942117595,0.22176087585107865,7.7252995931815463E-2,0.65163829897707493]
["2912","BRL",4.8352592405789743,7.5204666991317275,2.8278286467363339E-3,4.3982318445628726E-3,-0.55533888152628319]
["2912","CNY",0.6984586236239626,0.6984586236239626,4.0848302152406856E-4,4.0848302152406856E-4,0]
["2912","DKK",1.0801756298993357,1.0354338447458651,6.3172447179275814E-4,6.0555791164200261E-4,4.1420842976840899E-2]
["2912","HKD",21.655307351183659,21.222189182525113,1.2664780818292689E-2,1.2411478171254481E-2,2.0000555135730846E-2]
["2912","NOK",2.4641043616092309,2.6884604941915322,1.441094376869889E-3,1.572305686795691E-3,-9.104976886440852E-2]
["2912","NTD",4.6677637304118393,4.8284255009738581,2.7298714166719483E-3,2.8238320369046404E-3,-3.4419430768370063E-2]
["2912","SEK",4.4418580191649957,7.454141804529506,2.5977538589691523E-3,4.359442727451238E-3,-0.67815850312360393]
["2912","MXN",1.6837196126477332,4.88730032822117,9.8469809307410549E-4,2.8582640941694059E-3,-1.9026806432073604]
["2912","NZD",2.8429973273774767,0.17358290068833876,1.6626842295202795E-3,1.0151734885910616E-4,0.93894369895575658]
["2912","AUD",10.441355989703441,15.439990970230735,6.1064700172973364E-3,9.0298465084450667E-3,-0.47873427411694514]
["2912","CLP",2.750237225958329E-2,2.750237225958329E-2,1.6084348792753432E-5,1.6084348792753432E-5,0]
["2912","IDR",2.6583344339817208,4.236883792519925,1.5546869135643292E-3,2.4778777652356234E-3,-0.59381142506355489]
["2912","ILS",0.14909722352297042,-4.4342609617782163,8.7197268822471891E-5,-2.5933108342128079E-3,30.740734649529266]
["2912","KOR",5.287008882140011,-1.5559157114920479,3.0920276304926228E-3,-9.0995390359618401E-4,1.2942903532369825]
["2912","MYR",2.8923951933067196,2.8923951933067196,1.6915738284873924E-3,1.6915738284873924E-3,0]
["2912","PHP",2.3968874077795195,2.4513447227692184,1.4017835523352253E-3,1.4336320939935159E-3,-2.2720013803296801E-2]
["2912","PLN",0.54525795293703538,-1.0785611064790699,3.1888591334174954E-4,-6.3078024205211918E-4,2.9780749655633514]
["2912","SGD",1.2679357072321993,-1.5225046537619167,7.4153312919407769E-4,-8.9041394896994283E-4,2.2007743334915779]
["2912","THB",1.190931791164102,1.2967062834172076,6.9649854698578808E-4,7.5835916797940145E-4,-8.8816582979713843E-2]
["2912","TRL",0.37131026709547971,2.8397511289390156,2.171552253719885E-4,1.6607857391849048E-3,-6.6479197603463911]
["2912","ZAR",3.3421971908552148,5.9473362512300536,1.9546337619346333E-3,3.4782101612793838E-3,-0.77946898749807914]
["2912","COP",0.91882039570403884,0.94561931247779663,5.3735828978352328E-4,5.5303123321504455E-4,-2.9166654222148924E-2]
["2912","INR",1.2663475297233013,6.400933401161776,7.4060430746347152E-4,3.7434896325205763E-3,-4.054641992755645]
["2912","AED",0.10787091109868274,0.10787091109868274,6.3086680026256021E-5,6.3086680026256021E-5,0]
["2912","CZK",1.9697733649685785E-3,1.9697733649685785E-3,1.1519923279996454E-6,1.1519923279996454E-6,0]
["2912","HUF",0.10900417199798716,0.10901794067590727,6.3749450619481849E-5,6.3757503023688722E-5,-1.2631331138734936E-4]
["2912","QAR",0.12154903928972191,0.12154903928972191,7.1086127585911769E-5,7.1086127585911769E-5,0]
["2912","RUB",0.58298719248318531,0.58298719248318531,3.40951291659584E-4,3.40951291659584E-4,0]
["2912","PKR",8.9214141836538474E-2,8.9214141836538474E-2,5.2175549112678736E-5,5.2175549112678736E-5,0]
["2912","EGP",3.6423787423309748E-2,3.6423787423309748E-2,2.1301904277202033E-5,2.1301904277202033E-5,0]
["2912","MAD",5.8096300159863144E-3,5.8096300159863144E-3,3.3976747406366985E-6,3.3976747406366985E-6,0]
["2912","NGN",1.8453278453925543E-2,1.8453278453925543E-2,1.0792122374800458E-5,1.0792122374800458E-5,0]
["2912","PEN",-1.0599738965534717E-5,8.974306292604875E-2,-6.1990979187037981E-9,5.2484880657144391E-5,8467.5351871258608]
["2912","RON",-1.0663626539999991E-5,-1.0663626539999991E-5,-6.2364616057895334E-9,-6.2364616057895334E-9,0]
["291","BRL",1.7482143144236499,1.7573090401559768,1.4570163400216326E-3,1.4645961681300553E-3,-5.2022945111995789E-3]
["291","CAD",801.46237289322153,1002.4269001646267,0.66796374082025256,0.83545384634298037]
["291","CHF",12.834597353463138,12.830310808572657,1.0696753771724646E-2,1.0693181231506813E-2,3.3398358923386606E-4]
["291","CNY",1.9847687592446794,1.9847687592446794,1.6541681929525553E-3,1.6541681929525553E-3,0]
["291","DKK",3.0214749193730284,3.0214749193730284,2.5181914437895484E-3,2.5181914437895484E-3,0]
["291","EUR",36.616074906459787,35.510311461435926,3.0516978957329063E-2,2.9595401211222155E-2,3.0198852494394024E-2]
["291","GBP",7.2756947718444005,6.5891945789158104,6.0637909666596693E-3,5.4916402925275229E-3,9.4355276637664853E-2]
["291","HKD",6.4932182379520498,6.4932182379520498,5.4116506162699019E-3,5.4116506162699019E-3,0]
["291","JPY",10.346553980549984,10.15233806141905,8.623140817575984E-3,8.4612752125804193E-3,1.8771072909495534E-2]
["291","NOK",1.5519641113057498,1.4905496024042619,1.2934552992978508E-3,1.2422705319351764E-3,3.9572119261067629E-2]
["291","NTD",1.8942079999999999,1.9749563132992143,1.5786920314226893E-3,1.6459901944313414E-3,-4.2629063597669603E-2]
["291","NZD",7.5270220923347999,2.9859042459585403E-2,6.2732549949696594E-3,2.4885457350438401E-5,0.99603308691095882]
["291","SEK",1.7861905015019792,1.7826983862437076,1.4886668788876788E-3,1.4857564411052161E-3,1.9550631667424323E-3]
["291","USD",302.90923094614647,112.55120726594986,0.25245400142912316,9.3803686837854422E-2,0.62843256075626142]
["291","AUD",0.14456791190182353,2.3028825337862022E-2,1.2048740714790889E-4,1.9192941352748852E-5,0.84070583136387167]
["291","CLP",1.4117973701726282E-2,1.4117973701726282E-2,1.1766359651500983E-5,1.1766359651500983E-5,0]
["291","COP",7.4233379357339663E-3,2.0883306772985614E-2,6.1868413847375632E-6,1.7404799257667514E-5,-1.8131962944134541]
["291","IDR",1.7518036679909345E-2,4.552659742044636E-2,1.4600078192438883E-5,3.7943286357911822E-5,-1.5988413115185898]
["291","INR",0,8.6238664112045418E-3,0,7.1873992631339307E-6]
["291","KOR",0,3.776074567547584E-2,0,3.1470983280850095E-5]
["291","MXN",1.2615945838644937,3.1548605858367641E-2,1.0514522779087093E-3,2.6293592187922431E-5,0.97499307125928802]
["291","PEN",-8.1449450999755308E-5,4.4590697548542384E-2,-6.7882513038201987E-8,3.7163278212035383E-5,548.46467902744178]
["291","PHP",9.4748967384482852E-3,3.682123415999284E-2,7.8966744832358106E-6,3.068796507856034E-5,-2.8861884384001315]
["291","RUB",0.73407497042686809,0.73407497042686809,6.118009776538496E-4,6.118009776538496E-4,0]
["291","THB",1.7681930071430804E-2,7.0840098664772616E-2,1.4736672057103042E-5,5.9040347874823481E-5,-3.0063555493430538]
["291","ZAR",0.15266170461631898,0.14757274881897853,1.2723302645812243E-4,1.229917319616766E-4,3.3334855064866442E-2]
["291","CZK",6.0472326711745817E-3,6.0472326711745817E-3,5.0399523337153352E-6,5.0399523337153352E-6,0]
["291","HUF",5.3841384362357586E-3,5.4899383301039986E-3,4.4873089150515746E-6,4.5754858467165011E-6,-1.9650292265183333E-2]
["291","MYR",1.7498116523378134E-2,1.7498116523378134E-2,1.4583476112635337E-5,1.4583476112635337E-5,0]
["291","PLN",1.4000739803429186E-2,1.4000739803429186E-2,1.1668653263895056E-5,1.1668653263895056E-5,0]
["291","RON",-8.194036949150516E-5,-8.194036949150516E-5,-6.8291659821978395E-8,-6.8291659821978395E-8,0]
["291","TRL",5.5441998546580324E-3,5.5441998546580324E-3,4.6207090938077919E-6,4.6207090938077919E-6,0]
["292","CAD",49.975468635471984,66.481168635471988,0.53657442328020766,0.71379210027563389]
["292","DKK",0.78673199999999999,0.78673199999999999,8.4469496875603945E-3,8.4469496875603945E-3,0]
["292","EUR",3.4123250000000001,0.10833437000000011,3.6637301638429001E-2,1.1631597199853992E-3,0.96825203636816537]
["292","GBP",5.9733429999999998,0.11405994999999926,6.4134327556958484E-2,1.2246338766131897E-3,0.98090517320033366]
["292","HKD",1.2011320000000001,1.2011320000000001,1.2896261461487257E-2,1.2896261461487257E-2,0]
["292","JPY",0.91241799999999995,2.0996757900000027,9.7964096287229702E-3,2.2543707079817076E-2,-1.3012213590700785]
["292","MXN",0.77781699999999998,0.77781699999999998,8.3512315059374263E-3,8.3512315059374263E-3,0]
["292","NTD",0.91773199999999999,0.91773199999999999,9.8534647512293592E-3,9.8534647512293592E-3,0]
["292","SEK",1.492764,1.492764,1.6027443148875862E-2,1.6027443148875862E-2,0]
["292","USD",27.688200660637776,19.158545700637774,0.29728146042042747,0.2057006345491397,0.30806100636672895]
["2946","CAD",675.81225874782638,675.81225874782638,0.9309323008333833,0.9309323008333833]
["2946","USD",50.13976323098251,50.13976323098251,6.9067591692320351E-2,6.9067591692320351E-2,0]
["2947","CAD",131.22983579434342,131.22983579434342,0.98262258495539079,0.98262258495539079]
["2947","USD",2.3207750832937841,2.3207750832937841,1.7377496494166138E-2,1.7377496494166138E-2,0]
["296","AUD",10.736392180094922,10.736392180094922,2.1895530118397798E-2,2.1895530118397798E-2,0]
["296","CAD",27.103754528531038,27.103754528531038,5.5274720189651759E-2,5.5274720189651759E-2]
["296","DKK",11.851521588580372,11.851521588580372,2.4169697188661098E-2,2.4169697188661098E-2,0]
["296","EUR",49.79591469070531,49.79591469070531,0.10155254498852201,0.10155254498852201,0]
["296","GBP",36.313709867605887,36.313709867605887,7.4057273130450643E-2,7.4057273130450643E-2,0]
["296","HKD",15.021852300676819,15.021852300676819,3.063519047798835E-2,3.063519047798835E-2,0]
["296","JPY",36.145450018666111,36.145450018666111,7.3714128196064932E-2,7.3714128196064932E-2,0]
["296","KOR",13.725204,13.725204,2.7990838311617729E-2,2.7990838311617729E-2,0]
["296","NOK",5.0112230000000002,5.0112230000000002,1.0219763053172829E-2,1.0219763053172829E-2,0]
["296","NTD",12.671469999999999,12.671469999999999,2.5841879504342136E-2,2.5841879504342136E-2,0]
["296","SEK",10.526097590208657,10.526097590208657,2.1466660582956692E-2,2.1466660582956692E-2,0]
["296","SGD",1.632995,1.632995,3.3302892262060506E-3,3.3302892262060506E-3,0]
["296","USD",259.74932342394391,259.74932342394391,0.52972628410562883,0.52972628410562883,0]
["296","CHF",6.144251628285647E-2,6.144251628285647E-2,1.2530433345343171E-4,1.2530433345343171E-4,0]
["2979","CAD",83.836200000000005,579.82989999999995,0.12536143606359212,0.86702771519473687]
["2979","EUR",4.907521,4.907521,7.3382844173785983E-3,7.3382844173785983E-3,0]
["2979","GBP",2.4146589999999999,2.4146589999999999,3.6106731918178216E-3,3.6106731918178216E-3,0]
["2979","USD",577.59750393999991,81.603766399999969,0.86368958231246995,0.12202324704724096,0.85871863045918417]
["299","AUD",15.731912449999999,8.1461120399999984,0.15054000690887934,7.7950838251842985E-2,0.48219187807646369]
["299","CAD",2.9988999999999999,40.991799999999998,2.8696728903995283E-2,0.39225401710186864]
["299","CHF",2.2134079999999998,0.94097721999999995,2.1180289216024006E-2,9.0042909690803714E-3,0.57487403135797832]
["299","EUR",17.339247,12.741808669999999,0.16592072778632616,0.1219274497814421,0.26514636592927021]
["299","GBP",25.961431000000001,17.047053469999998,0.24842713907325326,0.16312470307129348,0.34337003726797655]
["299","HKD",13.733110999999999,9.4083721400000009,0.13141330600402668,9.0029512397706485E-2,0.31491326764926009]
["299","JPY",19.34492294,10.642686030000002,0.18511321127008551,0.10184076688560735,0.44984603645053334]
["299","KOR",2.381475,1.9763776799999999,2.2788536618974346E-2,1.8912125944468686E-2,0.17010353667370015]
["299","NTD",2.4418530000000001,1.36133543,2.3366298831040581E-2,1.3026734396650055E-2,0.44249902430654098]
["299","SEK",2.356865,1.2466480099999999,2.2553041437965535E-2,1.1929280730159458E-2,0.47105667486258229]
["299","USD",9.3999999999999994E-5,9.3999999999999994E-5,8.9949398678700745E-7,8.9949398678700745E-7,0]
["302","CAD",1274.9278971261679,1444.2547679891554,0.86567854032379965,0.98065181742965124]
["302","MXN",8.4800000000000001E-4,8.4800000000000001E-4,5.7579366162534869E-7,5.7579366162534869E-7,0]
["302","NZD",10.587816,3.4929150000000374E-2,7.1891478104427519E-3,2.3716961292407151E-5,0.99670100519313898]
["302","USD",187.23317177289772,28.459233602286353,0.12713169051043002,1.9323875380792006E-2,0.84800111362314767]
["3069","CAD",1607.7601999999999,1607.7601999999999,1,1]
["3069","USD",3.9999999999999998E-6,3.9999999999999998E-6,2.487933212925659E-9,2.487933212925659E-9,0]
["3072","BRL",5.1285449999999999,5.1285449999999999,1.8822287492146438E-3,1.8822287492146438E-3,0]
["3072","CAD",2147.4600063531334,2192.7609063531331,0.7881399035684642,0.80476579967453277]
["3072","CHF",43.092522230137973,34.861963990137973,1.5815398756906067E-2,1.2794699252190114E-2,0.19099736599413364]
["3072","CNY",4.0719074926697969,4.0719074926697969,1.4944319191594513E-3,1.4944319191594513E-3,0]
["3072","DKK",9.8550204235240582,9.8550204235240582,3.6168938295860634E-3,3.6168938295860634E-3,0]
["3072","EUR",116.51138198909815,82.588152599098166,4.2760875217163895E-2,3.0310701215753917E-2,0.29115807237763391]
["3072","GBP",21.436381920069088,18.289248310069091,7.867372584056306E-3,6.7123421888152261E-3,0.14681272342202489]
["3072","HKD",21.7408254338654,21.7408254338654,7.9791064840570546E-3,7.9791064840570546E-3,0]
["3072","JPY",33.704790967976258,33.704790967976258,1.2370004854436293E-2,1.2370004854436293E-2,0]
["3072","NOK",5.068092,5.068092,1.8600418766072527E-3,1.8600418766072527E-3,0]
["3072","NTD",6.4970049999999997,6.4970049999999997,2.3844676403914338E-3,2.3844676403914338E-3,0]
["3072","SEK",5.6385779999999999,5.6385779999999999,2.0694161046240617E-3,2.0694161046240617E-3,0]
["3072","USD",304.51422216148632,304.51422216148632,0.1117598506978265,0.1117598506978265,0]
["3077","CAD",195.10417415570856,211.4522375339651,0.713201192843534,0.77296136123823522]
["3077","USD",44.528332221206355,28.721208328239982,0.16277283555272587,0.1049900655803527,0.35499025237325921]
["3077","AUD",1.8646627986185904,1.8391062839797376,6.8162546392492446E-3,6.722833077131324E-3,1.370570306748542E-2]
["3077","EUR",14.004276652798817,13.965199275527372,5.1192481436690647E-2,5.1049634507844575E-2,2.7903888390862219E-3]
["3077","GBP",6.0513355564440348,6.0531333391996522,2.2120591503634414E-2,2.2127163279001744E-2,-2.970885912454424E-4]
["3077","HKD",1.5934746281087571,1.5934746281087571,5.8249292228165286E-3,5.8249292228165286E-3,0]
["3077","JPY",6.3841876387789842,6.3821727577252307,2.3337328681037311E-2,2.3329963305195441E-2,3.156049238770553E-4]
["3077","MXN",0.21639376168985094,0.15990534558250086,7.9102504920233914E-4,5.8453225670343912E-4,0.26104456831945466]
["3077","NOK",0.16784172255161725,0.16762965748209471,6.1354359664900302E-4,6.1276839508707631E-4,1.2634824422593782E-3]
["3077","NZD",0.53470654942896234,0.11154733225086981,1.9546139928797008E-3,4.0776006338205054E-4,0.79138588751157746]
["3077","SGD",3.6195535479538361E-2,3.6195535479538361E-2,1.3231238742752394E-4,1.3231238742752394E-4,0]
["3077","CHF",1.2573830175890435,1.25720806448352,4.5963499852648823E-3,4.5957104460848976E-3,1.3914066205455988E-4]
["3077","INR",-2.1379387779376008E-2,-2.1263750623871487E-2,-7.8152120181429268E-5,-7.772940981349507E-5,5.4088151025574183E-3]
["3077","KOR",0.62664252057363812,0.62715567180980891,2.2906849384109959E-3,2.2925607571900142E-3,-8.1888990823841823E-4]
["3077","SEK",0.88324601109194989,0.88310614468364845,3.2286962152964305E-3,3.2281849351576482E-3,1.5835498439276119E-4]
["3077","BRL",2.963502309593587E-2,2.9847896862678247E-2,1.083305055539158E-4,1.0910866329975979E-4,-7.183182076600847E-3]
["3077","RUB",8.4315794947387904E-2,8.4315794947387904E-2,3.0821547407815106E-4,3.0821547407815106E-4,0]
["3077","ZAR",2.094123856254157E-2,2.0998588726967523E-2,7.6550470470745008E-5,7.6760113374877442E-5,-2.7386233271100568E-3]
["3077","NTD",9.9678847220734917E-2,0.10077335006327139,3.6437494506068449E-4,3.6837588833237825E-4,-1.0980291938095244E-2]
["3077","COP",6.7711889977462086E-3,6.9484763814676364E-3,2.4752007951954477E-5,2.5400080060577438E-5,-2.6182607483034026E-2]
["3077","IDR",1.5979056626012077E-2,1.6428829882537417E-2,5.8411268213518866E-5,6.0055409475237782E-5,-2.8147672735145068E-2]
["3077","PEN",-7.429402126867915E-5,2.060471439759374E-4,-2.7158098907549445E-7,7.5320310035172171E-7,3.7734014185445997]
["3077","PHP",8.6425159551650043E-3,9.0113304292070619E-3,3.1592623351429236E-5,3.2940820661727837E-5,-4.2674433689838143E-2]
["3077","THB",1.6128551791001314E-2,1.6849999342359905E-2,5.8957746167955526E-5,6.1594989868299694E-5,-4.4731080676512658E-2]
["3077","CLP",3.4844161187147218E-3,3.4844161187147218E-3,1.2737245335649654E-5,1.2737245335649654E-5,0]
["3077","CZK",5.5159761935073747E-3,5.5159761935073747E-3,2.016359115805668E-5,2.016359115805668E-5,0]
["3077","HUF",4.9111355642705813E-3,5.0076408134624344E-3,1.7952602796999653E-5,1.8305376688881444E-5,-1.9650292265183333E-2]
["3077","MYR",1.5960886478579045E-2,1.5960886478579045E-2,5.8344847436621292E-5,5.8344847436621292E-5,0]
["3077","PLN",1.2770758402488622E-2,1.2770758402488622E-2,4.6683368849415129E-5,4.6683368849415129E-5,0]
["3077","RON",-7.4741811995560303E-5,-7.4741811995560303E-5,-2.7321788322159833E-7,-2.7321788322159833E-7,0]
["3077","TRL",5.0571353994885628E-3,5.0571353994885628E-3,1.8486303611362148E-5,1.8486303611362148E-5,0]
["3078","CAD",156.44869696676651,167.40273736992714,0.64487536001931756,0.69002748263594071]
["3078","USD",46.68200211810553,36.128368784769791,0.19242137202798618,0.14891971156486025,0.2260749936696167]
["3078","AUD",2.3313957539723402,2.316300935989863,9.6099213693661666E-3,9.5477011248412541E-3,6.4745841441796737E-3]
["3078","EUR",15.418451186871438,15.395370344061664,6.3554247832349309E-2,6.3459109508380629E-2,1.4969624724322506E-3]
["3078","GBP",7.5599666561786751,7.5610285068986025,3.1161884462181735E-2,3.1166261368979785E-2,-1.4045706392895596E-4]
["3078","HKD",2.104184677013508,2.104184677013508,8.673366269227949E-3,8.673366269227949E-3,0]
["3078","JPY",6.8373756084155648,6.8361855297529406,2.8183392655554813E-2,2.8178487198233081E-2,1.7405489046984357E-4]
["3078","MXN",0.19494433305398154,0.16157975375557476,8.0355285406190997E-4,6.6602537378175359E-4,0.17114926489895899]
["3078","NOK",0.22658622526300431,0.22646097016972891,9.3397948608633984E-4,9.3346318953075149E-4,5.5279217935699787E-4]
["3078","NZD",0.44934330220643831,0.11850286601895904,1.852175373785313E-3,4.8846414108217554E-4,0.7362754369831106]
["3078","SGD",3.838935064958926E-2,3.838935064958926E-2,1.5823938965960546E-4,1.5823938965960546E-4,0]
["3078","CHF",1.8183986903976692,1.8182953552864201,7.4953677011317631E-3,7.4949417578777672E-3,5.682753281488484E-5]
["3078","INR",-3.1879539790823745E-2,-3.1811239326577395E-2,-1.3140620598600902E-4,-1.3112467416551894E-4,2.1424545239517867E-3]
["3078","KOR",0.91935091679959946,0.9196540068186001,3.7895282284209158E-3,3.7907775535281924E-3,-3.2967826915952791E-4]
["3078","SEK",1.2788666757412346,1.2787840643990775,5.2714380108293572E-3,5.2710974901344068E-3,6.4597306133729049E-5]
["3078","BRL",1.7503767077048808E-2,1.7629499822989662E-2,7.2149837706247689E-5,7.266810312728887E-5,-7.183182076600847E-3]
["3078","RUB",4.9800671013402492E-2,4.9800671013402492E-2,2.052764022431812E-4,2.052764022431812E-4,0]
["3078","ZAR",1.2368829979211609E-2,1.240270354552174E-2,5.0983829462997612E-5,5.1123454967670388E-5,-2.7386233271102789E-3]
["3078","NTD",0.19094065618407927,0.1915871184040987,7.8704985587185348E-4,7.8971454765233197E-4,-3.3856708829795856E-3]
["3078","COP",3.9993663803649659E-3,4.104080220482904E-3,1.6485230522149216E-5,1.6916856842177978E-5,-2.6182607483034026E-2]
["3078","IDR",9.4379438945349052E-3,9.7036000505709361E-3,3.8902832588776332E-5,3.9997856788955352E-5,-2.814767273514529E-2]
["3078","PEN",-4.388136426600625E-5,1.21700637903014E-4,-1.8087725323267334E-7,5.0164523069794684E-7,3.7734014185445988]
["3078","PHP",5.1046555877202011E-3,5.3224938741078288E-3,2.104118905256819E-5,2.1939109879547363E-5,-4.2674433689838143E-2]
["3078","THB",9.5262424100665318E-3,9.9523615278552316E-3,3.9266795588127645E-5,4.1023241789488303E-5,-4.4731080676512436E-2]
["3078","CLP",2.0580516486879718E-3,2.0580516486879718E-3,8.4832077455265258E-6,8.4832077455265258E-6,0]
["3078","CZK",3.2579816854247791E-3,3.2579816854247791E-3,1.3429272042904577E-5,1.3429272042904577E-5,0]
["3078","HUF",2.9007358193215613E-3,2.9577361259553159E-3,1.1956718669272686E-5,1.2191671685656467E-5,-1.9650292265183333E-2]
["3078","MYR",9.4272117946342625E-3,9.4272117946342625E-3,3.8858595296159826E-5,3.8858595296159826E-5,0]
["3078","PLN",7.5429797962627693E-3,7.5429797962627693E-3,3.1091865295411716E-5,3.1091865295411716E-5,0]
["3078","RON",-4.4145849451565794E-5,-4.4145849451565794E-5,-1.8196745073872043E-7,-1.8196745073872043E-7,0]
["3078","TRL",2.9869698371142966E-3,2.9869698371142966E-3,1.2312171890348828E-5,1.2312171890348828E-5,0]
["3079","CAD",319.82765898772419,343.53537085242226,0.55711805524384994,0.59841527878651135]
["3079","USD",146.00722626582828,122.97608794671693,0.25433466950989747,0.21421599112227271,0.15773971541093224]
["3079","AUD",4.6125681108862144,4.585820818546841,8.0347803055875154E-3,7.9881883393444642E-3,5.7987853396129774E-3]
["3079","CHF",7.7522319683588101,7.7520488635056939,1.350386145989029E-2,1.3503542503674944E-2,2.3619630303062245E-5]
["3079","EUR",42.635007589754785,42.594109445054471,7.4267286915990771E-2,7.4196045126238633E-2,9.5926204807672555E-4]
["3079","GBP",22.907005381733203,22.908886930199678,3.9902447243380663E-2,3.9905724772990855E-2,-8.2138561331879245E-5]
["3079","HKD",5.1639941836497734,5.1639941836497734,8.9953270645549109E-3,8.9953270645549109E-3,0]
["3079","INR",-0.12151168598396157,-0.12139066084233796,-2.1166510238373226E-4,-2.1145428480857204E-4,9.9599590478549604E-4]
["3079","JPY",15.664984956646828,15.662876194425712,2.7287339631892876E-2,2.7283666311357313E-2,1.3461629404387665E-4]
["3079","KOR",2.9738351167246533,2.97437217767847,5.1802187530913257E-3,5.1811542767889471E-3,-1.8059540382586725E-4]
["3079","SEK",4.6526903421414012,4.6525439588115862,8.104670506828027E-3,8.1044155170116854E-3,3.1462083020850073E-5]
["3079","MXN",7.6998364371336725E-2,1.7877932623792239E-2,1.3412592003858855E-4,3.1142144136852174E-5,0.76781412475759747]
["3079","NZD",0.55383308723425217,5.2840312150908447E-4,9.6473961466067896E-4,9.204423418901992E-7,0.99904591629917261]
["3079","BRL",3.101583441374297E-2,3.123862679959459E-2,5.4027476563598232E-5,5.441556576489385E-5,-7.183182076600847E-3]
["3079","RUB",8.8244396708768755E-2,8.8244396708768755E-2,1.5371574439858882E-4,1.5371574439858882E-4,0]
["3079","ZAR",2.1916972548725683E-2,2.197699488100726E-2,3.8177877303749894E-5,3.8282432129113502E-5,-2.7386233271102789E-3]
["3079","NOK",0.78000921495427422,0.77978726894600026,1.35872306442479E-3,1.358336449555738E-3,2.8454280285261646E-4]
["3079","NTD",0.34804458899555185,0.34919008899464371,6.0627003046909503E-4,6.0826541365076162E-4,-3.2912449591524506E-3]
["3079","COP",7.0866851042561138E-3,7.2722329986967156E-3,1.2344524034928026E-5,1.2667735862299427E-5,-2.6182607483034026E-2]
["3079","IDR",1.6723583200722387E-2,1.7194313147615291E-2,2.913134585978002E-5,2.9951325449375431E-5,-2.8147672735145068E-2]
["3079","PEN",-7.7755669504319026E-5,2.156476841031634E-4,-1.3544509413456463E-7,3.7564361620770834E-7,3.7734014185445992]
["3079","PHP",9.0452044837545723E-3,9.4312034627075849E-3,1.5756131746772152E-5,1.6428515746208137E-5,-4.2674433689838365E-2]
["3079","THB",1.6880043928556181E-2,1.76351065353475E-2,2.9403889818888155E-5,3.0719157586580119E-5,-4.4731080676512436E-2]
["3079","CLP",3.6467686566930236E-3,3.6467686566930236E-3,6.3524232656157654E-6,6.3524232656157654E-6,0]
["3079","CZK",5.7729870394950073E-3,5.7729870394950073E-3,1.0056151248991435E-5,1.0056151248991435E-5,0]
["3079","HUF",5.1399645261538526E-3,5.2409663313254503E-3,8.9534690335932523E-6,9.1294073168906281E-6,-1.9650292265183333E-2]
["3079","MYR",1.6704566435247568E-2,1.6704566435247568E-2,2.9098219946180513E-5,2.9098219946180513E-5,0]
["3079","PLN",1.3365797848958794E-2,1.3365797848958794E-2,2.32823118799746E-5,2.32823118799746E-5,0]
["3079","RON",-7.822432454777875E-5,-7.822432454777875E-5,-1.3626145938333297E-7,-1.3626145938333297E-7,0]
["3079","TRL",5.2927670631687709E-3,5.2927670631687709E-3,9.2196406728051852E-6,9.2196406728051852E-6,0]
["307","CAD",868.66989999999998,868.66989999999998,1,1]
["3080","CAD",168.05919012723277,175.91219516129146,0.45456674659508167,0.47580756625287207]
["3080","USD",114.73504327351321,107.11831833962849,0.31033551513488766,0.28973378624232071,6.6385340664642967E-2]
["3080","AUD",3.0916051570604073,3.0916051570604073,8.3621782119596248E-3,8.3621782119596248E-3,0]
["3080","CHF",5.0709732647967014,5.0709732647967014,1.3715976004074246E-2,1.3715976004074246E-2,0]
["3080","EUR",28.52718994072444,28.52718994072444,7.7160385641735635E-2,7.7160385641735635E-2,0]
["3080","GBP",15.476068291247278,15.476068291247278,4.185969245662588E-2,4.185969245662588E-2,0]
["3080","HKD",7.4222735732197753,7.4222735732197753,2.0075776563976466E-2,2.0075776563976466E-2,0]
["3080","INR",0.83335158999416103,0.83335158999416103,2.2540506160162684E-3,2.2540506160162684E-3,0]
["3080","JPY",10.417136056117789,10.417136056117789,2.8176285047445702E-2,2.8176285047445702E-2,0]
["3080","KOR",4.3160927276969945,4.3160927276969945,1.167417400825612E-2,1.167417400825612E-2,0]
["3080","SEK",3.2547006761331376,3.2547006761331376,8.8033192137281051E-3,8.8033192137281051E-3,0]
["3080","DKK",0.3575786967216476,0.3575786967216476,9.6717938898439198E-4,9.6717938898439198E-4,0]
["3080","NOK",0.61096952479006683,0.61096952479006683,1.6525512763824763E-3,1.6525512763824763E-3,0]
["3080","NTD",2.8819939978629372,2.8819939978629372,7.7952216378247476E-3,7.7952216378247476E-3,0]
["3080","SGD",4.9269979343041635E-2,4.9269979343041635E-2,1.3326551316722148E-4,1.3326551316722148E-4,0]
["3080","MXN",0.36552147341144942,0.36552147341144942,9.8866302314971812E-4,9.8866302314971812E-4,0]
["3080","NZD",0.23706090791487172,7.8206270412092826E-4,6.4120269515851821E-4,2.1153243614732628E-6,0.99670100519313898]
["3080","AED",0.15506036388167022,0.15506036388167022,4.1940750209600535E-4,4.1940750209600535E-4,0]
["3080","BRL",0.9772133398468863,0.9772133398468863,2.643168090285425E-3,2.643168090285425E-3,0]
["3080","CNY",0.49350647573552842,0.49350647573552842,1.3348370471669461E-3,1.3348370471669461E-3,0]
["3080","IDR",4.821629618193303E-2,4.821629618193303E-2,1.3041550939102485E-4,1.3041550939102485E-4,0]
["3080","MYR",0.18417252001610451,0.18417252001610451,4.9815010516566908E-4,4.9815010516566908E-4,0]
["3080","NGN",4.0062814198515047E-2,4.0062814198515047E-2,1.0836195923516611E-4,1.0836195923516611E-4,0]
["3080","PHP",0.28237269862957814,0.28237269862957814,7.6376209385601137E-4,7.6376209385601137E-4,0]
["3080","PKR",5.1744576473216376E-3,5.1744576473216376E-3,1.3995880715337868E-5,1.3995880715337868E-5,0]
["3080","RUB",0.64840460764587893,0.64840460764587893,1.7538057439864254E-3,1.7538057439864254E-3,0]
["3080","THB",0.46726730996900767,0.46726730996900767,1.2638653127034726E-3,1.2638653127034726E-3,0]
["3080","TRL",0.13676632335108821,0.13676632335108821,3.699257541489307E-4,3.699257541489307E-4,0]
["3080","ZAR",0.56872774681238891,0.56872774681238891,1.5382956526872309E-3,1.5382956526872309E-3,0]
["3081","CAD",93.368450886050596,97.305080676270904,0.35688834559248994,0.3719355834946852]
["3081","USD",96.501577596049458,92.564948027340634,0.36886430104052226,0.35381706398502488,4.079342189810975E-2]
["3081","AUD",2.4469792585090779,2.4469792585090779,9.3532491005365384E-3,9.3532491005365384E-3,0]
["3081","CHF",4.6295069477834527,4.6295069477834527,1.769566764602087E-2,1.769566764602087E-2,0]
["3081","EUR",22.581835013364771,22.581835013364771,8.6316027114961738E-2,8.6316027114961738E-2,0]
["3081","GBP",12.822997876306422,12.822997876306422,4.9014184707810438E-2,4.9014184707810438E-2,0]
["3081","HKD",6.7681747326226454,6.7681747326226454,2.5870437605894414E-2,2.5870437605894414E-2,0]
["3081","INR",0.72918276654652148,0.72918276654652148,2.7872030511135182E-3,2.7872030511135182E-3,0]
["3081","JPY",8.0030251849218033,8.0030251849218033,3.0590487374236735E-2,3.0590487374236735E-2,0]
["3081","KOR",3.7316297002323835,3.7316297002323835,1.4263652630427266E-2,1.4263652630427266E-2,0]
["3081","SEK",2.7119457578575319,2.7119457578575319,1.0366047906691211E-2,1.0366047906691211E-2,0]
["3081","DKK",0.34866909568965876,0.34866909568965876,1.3327407227927226E-3,1.3327407227927226E-3,0]
["3081","NOK",0.473396361939601,0.473396361939601,1.8094939223991038E-3,1.8094939223991038E-3,0]
["3081","NTD",2.5890830730373082,2.5890830730373082,9.8964218188164668E-3,9.8964218188164668E-3,0]
["3081","SGD",4.8042345082876116E-2,4.8042345082876116E-2,1.8363540245447895E-4,1.8363540245447895E-4,0]
["3081","AED",0.1370119444186258,0.1370119444186258,5.2370972963501302E-4,5.2370972963501302E-4,0]
["3081","BRL",0.86346953181675379,0.86346953181675379,3.3004961499863879E-3,3.3004961499863879E-3,0]
["3081","CNY",0.43606425350134931,0.43606425350134931,1.6667969590076119E-3,1.6667969590076119E-3,0]
["3081","IDR",4.2604108020746947E-2,4.2604108020746947E-2,1.6284847271938352E-4,1.6284847271938352E-4,0]
["3081","MXN",0.32295942780620551,0.32295942780620551,1.2344689752207723E-3,1.2344689752207723E-3,0]
["3081","MYR",0.16273555952145979,0.16273555952145979,6.2203478857716574E-4,6.2203478857716574E-4,0]
["3081","NGN",3.539965942817927E-2,3.539965942817927E-2,1.3531043696204226E-4,1.3531043696204226E-4,0]
["3081","PHP",0.24950562169128584,0.24950562169128584,9.5370168077547326E-4,9.5370168077547326E-4,0]
["3081","PKR",4.5721710295507203E-3,4.5721710295507203E-3,1.7476508810172997E-5,1.7476508810172997E-5,0]
["3081","RUB",0.57293284911515518,0.57293284911515518,2.1899587571164044E-3,2.1899587571164044E-3,0]
["3081","THB",0.41287922393223825,0.41287922393223825,1.5781753018320912E-3,1.5781753018320912E-3,0]
["3081","TRL",0.12084725860451953,0.12084725860451953,4.6192239223707965E-4,4.6192239223707965E-4,0]
["3081","ZAR",0.50253006303437786,0.50253006303437786,1.9208535763939035E-3,1.9208535763939035E-3,0]
["3085","CAD",145.8766,145.8766,0.9047570315983896,0.9047570315983896]
["3085","USD",15.356292310000001,15.356292310000001,9.5242920706629972E-2,9.5242920706629972E-2,0]
["3086","CAD",50.834000000000003,50.834000000000003,0.90061583598494788,0.90061583598494788]
["3086","USD",5.6096347099999999,5.6096347099999999,9.938477896519711E-2,9.938477896519711E-2,0]
["3087","CAD",88.706900000000005,88.706900000000005,0.90722759721000634,0.90722759721000634]
["3087","USD",9.0711220000000008,9.0711220000000008,9.2772627789482309E-2,9.2772627789482309E-2,0]
["3091","CAD",283.4556,283.4556,1,1]
["3091","USD",6.0000000000000002E-6,6.0000000000000002E-6,2.1167336260070361E-8,2.1167336260070361E-8,0]
["3092","CAD",292.59100000000001,292.59100000000001,1,1]
["3093","CAD",246.35730000000001,246.35730000000001,0.99894168437622033,0.99894168437622033]
["3093","USD",0.26097100000000001,0.26097100000000001,1.0581980331548794E-3,1.0581980331548794E-3,0]
["3102","CAD",150.34739999999999,150.34739999999999,1,1]
["3864","CAD",1797.0096944251175,1931.5128820444966,0.90724217910475391,0.97514774767842749]
["3864","NZD",5.4020707515619399,-7.8869410106398828E-3,2.7273010577124283E-3,-3.9818180008498254E-6,1.0014599847675745]
["3864","USD",177.10265223858585,48.38688635740391,8.9412425898774961E-2,2.442870751068978E-2,0.72678621270889288]
["3864","AUD",0.10855682260141646,1.8424155160075586E-2,5.4806230928600756E-5,9.301658598418653E-6,0.83028100198066057]
["3864","BRL",7.4395935888691339E-2,8.1683596280416354E-2,3.7559692193973564E-5,4.1238956092702358E-5,-9.7957775578340289E-2]
["3864","CHF",9.5471853294788814E-7,-3.4100358431243673E-3,4.8200125182987952E-10,-1.7215980296262033E-6,3572.7708680014689]
["3864","CLP",1.0304994555148876E-2,1.0304994555148876E-2,5.2026017137691488E-6,5.2026017137691488E-6,0]
["3864","COP",3.8402071282076225E-3,1.466978432673147E-2,1.9387752297703996E-6,7.4062188650787051E-6,-2.8200502829592011]
["3864","EUR",0.11225508969074086,6.8349516044245259E-2,5.6673346005074192E-5,3.4507083667444507E-5,0.39112323340931832]
["3864","GBP",2.0847658839749251E-2,3.5047294153420581E-2,1.0525193878298663E-5,1.7694052301507807E-5,-0.68111414441402673]
["3864","IDR",9.0623503756385292E-3,3.1571547412546044E-2,4.5752377007823033E-6,1.5939279326720907E-5,-2.4838144745999768]
["3864","INR",0,6.9379073951499476E-3,0,3.5026868486741574E-6]
["3864","JPY",0.24530933767607507,8.8874152511157822E-2,1.2384739979891092E-4,4.486919577587787E-5,0.6377057907656416]
["3864","KOR",0,3.0376371142095227E-2,0,1.5335880064389729E-5]
["3864","MXN",0.29082900156942298,5.7910763058984863E-3,1.4682855520994415E-4,2.9236952384978829E-6,0.98008769319893252]
["3864","NOK",4.5495084801473296E-2,-4.1083174989481669E-3,2.2968746357847854E-5,-2.0741340081597672E-6,1.0903024473275655]
["3864","NTD",0,6.4958327335640498E-2,0,3.2795000842685859E-5]
["3864","PEN",-4.2135056362206706E-5,3.5998470121006203E-2,-2.1272395173682783E-8,1.8174265046169998E-5,855.35913059072698]
["3864","PHP",4.9015101170148626E-3,2.6900980270631248E-2,2.4745869392135685E-6,1.3581286754598801E-5,-4.488304548683578]
["3864","RUB",0.12452651300125736,0.12452651300125736,6.2868723169420257E-5,6.2868723169420257E-5,0]
["3864","SEK",8.6804121268603443E-2,8.4024442213885137E-2,4.382411535080495E-5,4.2420760605063725E-5,3.2022431816537522E-2]
["3864","THB",9.1471349531204657E-3,5.191015945214663E-2,4.6180422249135974E-6,2.6207474742704138E-5,-4.6750184312562189]
["3864","ZAR",5.3146878691342242E-2,4.9012679083600817E-2,2.6831847477581087E-5,2.4744646572312047E-5,7.7788192073354967E-2]
["3864","CZK",3.1283266652845118E-3,3.1283266652845118E-3,1.5793737282381122E-6,1.5793737282381122E-6,0]
["3864","HUF",2.7852977974449295E-3,2.8400297132102933E-3,1.406191436278258E-6,1.4338235089819235E-6,-1.9650292265183111E-2]
["3864","MYR",9.0520453716405411E-3,9.0520453716405411E-3,4.5700350943012023E-6,4.5700350943012023E-6,0]
["3864","PLN",7.2427984902175913E-3,7.2427984902175913E-3,3.6566148226505552E-6,3.6566148226505552E-6,0]
["3864","RON",-4.2389016064392929E-5,-4.2389016064392929E-5,-2.1400609815112377E-8,-2.1400609815112377E-8,0]
["3864","TRL",2.8681000361814131E-3,2.8681000361814131E-3,1.4479951526071627E-6,1.4479951526071627E-6,0]
["3914","AUD",1.8668262900000001,1.7641361100000001,1.3523714703768317E-3,1.2779803658248055E-3,5.5007892566158345E-2]
["3914","BRL",0.59423172000000002,0.59423172000000002,4.304749880723791E-4,4.304749880723791E-4,0]
["3914","CAD",1308.4793,1381.4123,0.94789219777842715,1.0007265235951015]
["3914","CHF",0.58873399999999998,1.2452680199999999,4.2649231452640063E-4,9.0210050728428822E-4,-1.1151623993178581]
["3914","CLP",2.6081E-2,2.6081E-2,1.8893670240147596E-5,1.8893670240147596E-5,0]
["3914","DKK",0.73398920999999995,0.45659198000000001,5.3171849597662829E-4,3.307656264873305E-4,0.37793093715914428]
["3914","EUR",7.4492171100000002,5.9183773200000003,5.3963824862392276E-3,4.2874072865629574E-3,0.20550344652258357]
["3914","GBP",4.3845179999999999,4.44943168,3.1762446706027937E-3,3.2232696184189996E-3,-1.4805203217320706E-2]
["3914","HKD",2.39153349,2.1276308400000001,1.7324813131524605E-3,1.5413042246742164E-3,0.11034871604495067]
["3914","IDR",0.14937979000000001,0.14937979000000001,1.0821412111508369E-4,1.0821412111508369E-4,0]
["3914","ILS",0.499971,0.499971,3.621903762753282E-4,3.621903762753282E-4,0]
["3914","JPY",8.1555252500000002,8.1555252500000002,5.9080481848356008E-3,5.9080481848356008E-3,0]
["3914","KOR",0.53559841000000008,0.53559841000000008,3.879996832823654E-4,3.879996832823654E-4,0]
["3914","MXN",0.112695,0.112695,8.1638823960485934E-5,8.1638823960485934E-5,0]
["3914","MYR",0.43097999999999997,0.43097999999999997,3.122117250143327E-4,3.122117250143327E-4,0]
["3914","NOK",0.56298314999999999,0.56298314999999999,4.0783781246346194E-4,4.0783781246346194E-4,0]
["3914","NTD",1.39073896,1.39073896,1.0074829684584877E-3,1.0074829684584877E-3,0]
["3914","NZD",0.37596329000000001,0.37596329000000001,2.7235636761094209E-4,2.7235636761094209E-4,0]
["3914","PHP",0.131855,0.131855,9.551876421589131E-5,9.551876421589131E-5,0]
["3914","PLN",0.22626203,0.22626203,1.6390936630828506E-4,1.6390936630828506E-4,0]
["3914","SEK",1.66133207,1.3926307600000001,1.2035067784962924E-3,1.0088534314530169E-3,0.16173847170722466]
["3914","SGD",1.0255510000000001,1.0255510000000001,7.4293249524380242E-4,7.4293249524380242E-4,0]
["3914","THB",0.31074299999999999,0.31074299999999999,2.2510930452951131E-4,2.2510930452951131E-4,0]
["3914","TRL",0.21798799999999999,0.21798799999999999,1.5791547058430637E-4,1.5791547058430637E-4,0]
["3914","USD",37.792254999999997,-33.418661369999995,2.7377570016547264E-2,-2.4209239208310227E-2,1.8842727529754444]
["3914","ZAR",0.31507040000000003,0.31507040000000003,2.2824417162039032E-4,2.2824417162039032E-4,0]
["3997","AUD",9.4217889199999991,5.810968850000001,8.7408293639071911E-3,5.3909812232165793E-3,0.38324145240986762]
["3997","BRL",7.5337649999999998,7.5337649999999998,6.9892623250125052E-3,6.9892623250125052E-3,0]
["3997","CAD",730.7423,907.36429999999996,0.67792791873425651,0.84178456814771163]
["3997","COP",3.6482869999999998,3.6482869999999998,3.3846071492716987E-3,3.3846071492716987E-3,0]
["3997","EUR",27.941355000000001,9.0038648200000004,2.59218942734874E-2,8.3531107176732372E-3,0.6777584759221591]
["3997","GBP",3.6351689999999999,3.6351689999999999,3.3724372523901906E-3,3.3724372523901906E-3,0]
["3997","IDR",8.6644590000000008,8.6644590000000008,8.0382354447365335E-3,8.0382354447365335E-3,0]
["3997","INR",0.31209100000000001,0.31209100000000001,2.8953463086192334E-4,2.8953463086192334E-4,0]
["3997","JPY",3.8034400000000002,3.8034399899999998,3.5285464701176059E-3,3.5285464608403555E-3,2.6291989696503038E-9]
["3997","MXN",2.2959999999999999E-3,2.2959999999999999E-3,2.1300566580227431E-6,2.1300566580227431E-6,0]
["3997","MYR",4.4296430000000004,4.4296430000000004,4.1094906641175261E-3,4.1094906641175261E-3,0]
["3997","NOK",7.0312710000000003,7.0312710000000003,6.5230860661638643E-3,6.5230860661638643E-3,0]
["3997","NZD",3.9079860000000002,3.8105733999999996,3.6255364106096118E-3,3.5351643038128754E-3,2.4926547843313829E-2]
["3997","PHP",7.7791439999999996,7.7791439999999996,7.2169065639885342E-3,7.2169065639885342E-3,0]
["3997","SGD",3.6946650000000001,-1.1911799999999815E-2,3.4276331804937278E-3,-1.1050874956025662E-5,1.0032240541429331]
["3997","USD",255.35798015,105.08831724999995,0.23690198858786893,9.7493061776467202E-2,0.58846668042929395]
["3998","AED",0.29247299999999998,0.29247299999999998,1.0572217623435257E-2,1.0572217623435257E-2,0]
["3998","BRL",1.8432080900000001,1.8432080900000001,6.6627678632750514E-2,6.6627678632750514E-2,0]
["3998","CAD",0.46970000000000001,0.46970000000000001,1.6978560816648173E-2,1.6978560816648173E-2]
["3998","CNY",0.93084599999999995,0.93084599999999995,3.3647914460152611E-2,3.3647914460152611E-2,0]
["3998","HKD",6.4156296100000008,6.4156296100000008,0.23191006495736385,0.23191006495736385,0]
["3998","IDR",9.0944999999999998E-2,9.0944999999999998E-2,3.2874498902918199E-3,3.2874498902918199E-3,0]
["3998","INR",1.71812674,1.71812674,6.2106279211836195E-2,6.2106279211836195E-2,0]
["3998","KOR",3.9386742200000002,3.9386742200000002,0.14237389776715839,0.14237389776715839,0]
["3998","MXN",0.68940641000000003,0.68940641000000003,2.4920435724019765E-2,2.4920435724019765E-2,0]
["3998","MYR",0.34738400000000003,0.34738400000000003,1.2557122356249752E-2,1.2557122356249752E-2,0]
["3998","NGN",7.5565999999999994E-2,7.5565999999999994E-2,2.7315348662355454E-3,2.7315348662355454E-3,0]
["3998","NTD",4.2930717699999992,4.2930717699999992,0.15518454361758655,0.15518454361758655,0]
["3998","PHP",0.53260799999999997,0.53260799999999997,1.925253847015829E-2,1.925253847015829E-2,0]
["3998","PKR",9.7599999999999996E-3,9.7599999999999996E-3,3.5280126372255939E-4,3.5280126372255939E-4,0]
["3998","RUB",1.2230129999999999,1.2230129999999999,4.4209070896426075E-2,4.4209070896426075E-2,0]
["3998","THB",0.88135399999999997,0.88135399999999997,3.1858893953579159E-2,3.1858893953579159E-2,0]
["3998","TRL",0.257967,0.257967,9.3249061064259713E-3,9.3249061064259713E-3,0]
["3998","USD",2.5818597099999998,2.5818597099999998,9.3328213979750066E-2,9.3328213979750066E-2,0]
["3998","ZAR",1.0727274599999999,1.0727274599999999,3.8776598721095415E-2,3.8776598721095415E-2,0]
["3999","AUD",5.6102559999999997,5.6102559999999997,8.0043943689300998E-2,8.0043943689300998E-2,0]
["3999","CAD",0.78420000000000001,0.78420000000000001,1.118851985384443E-2,1.118851985384443E-2]
["3999","EUR",5.7975580000000004,5.7975580000000004,8.2716262161202009E-2,8.2716262161202009E-2,0]
["3999","GBP",4.2517040000000001,4.2517040000000001,6.0660895966169068E-2,6.0660895966169068E-2,0]
["3999","HKD",3.6324040000000002,3.6324040000000002,5.1825075581718859E-2,5.1825075581718859E-2,0]
["3999","JPY",6.6136041799999994,6.6136041799999994,9.4359145209638493E-2,9.4359145209638493E-2,0]
["3999","KOR",1.0376430000000001,1.0376430000000001,1.4804500518621139E-2,1.4804500518621139E-2,0]
["3999","SEK",1.3086089999999999,1.3086089999999999,1.8670489387171009E-2,1.8670489387171009E-2,0]
["3999","USD",41.053719999999998,41.053719999999998,0.58573114166560847,0.58573114166560847,0]
["4324","CAD",34.160800000000002,905.29179999999997,3.6505871472847042E-2,0.96743829466002995]
["4324","EUR",7.0277859999999999,1.5523800000008196E-3,7.510229633225036E-3,1.6589478219786484E-6,0.99977910824262428]
["4324","USD",894.57325878999995,30.468472370000001,0.95598394675867293,3.256007284118672E-2,0.96594077447473481]
["4345","CAD",253.21881745251841,317.7835919994809,0.77906243005271025,0.9777048163508526]
["4345","EUR",0.28784480661937351,-7.0879140161945421E-3,8.8559403593688679E-4,-2.1806939835727703E-5,1.0246240816342644]
["4345","NZD",0.70282900000000004,-5.9577411859819502E-3,2.1623498370305283E-3,-1.8329808079316786E-5,1.0084768004535698]
["4345","USD",70.283006293745004,7.0599695833647775,0.21623531073034138,2.1720964954532771E-2,0.89954940809079909]
["4345","BRL",2.8752273334318311E-2,2.9335881978328791E-2,8.8460313331863659E-5,9.0255865388289426E-5,-2.0297826096202787E-2]
["4345","GBP",0.16499775048362791,1.1869869850456754E-2,5.076382147985877E-4,3.6519282978802439E-5,0.9280604140622235]
["4345","MXN",0.19961733803902082,3.3099884722187526E-3,6.1415012524688724E-4,1.0183633619949015E-5,0.9834183317705012]
["4345","RUB",0.12503460043991962,0.12503460043991962,3.8468610129126349E-4,3.8468610129126349E-4,0]
["4345","ZAR",1.7990702703293691E-2,1.7681800329655186E-2,5.5350864945145689E-5,5.4400484415464123E-5,1.7170111625598228E-2]
["4345","AUD",-1.2799428469531396E-5,4.6765292156070752E-3,-3.9379197593120254E-8,1.4387983687691407E-5,366.37015904572564]
["4345","CHF",1.4464372017764873E-3,6.6500842876432594E-4,4.4501624826754167E-6,2.045989661158643E-6,0.5402438294952765]
["4345","COP",0,7.9185483628615972E-4,0,2.436250035492578E-6]
["4345","IDR",0,1.6816479474643098E-3,0,5.17382060948278E-6]
["4345","INR",0,5.1649383570638867E-4,0,1.5890641414440526E-6]
["4345","JPY",0,-8.9994746014360437E-3,0,-2.7688118216202815E-5]
["4345","KOR",0,2.2919921292681952E-3,0,7.0516282156802512E-6]
["4345","NOK",0,-9.4718951447014821E-4,0,-2.9141584827199081E-6]
["4345","NTD",0,4.888601495486488E-3,0,1.5040453150158011E-5]
["4345","PEN",0,2.7013313381991358E-3,0,8.3110164476997396E-6]
["4345","PHP",0,1.6473113812849531E-3,0,5.0681794531245189E-6]
["4345","SEK",0,-6.2471389403257176E-4,0,-1.9220179971970965E-6]
["4345","THB",0,3.2223484868374205E-3,0,9.9139971819154674E-6]
["4444","CAD",946.31403619403625,1208.7033845878732,0.68352449863686182,0.87304884356771906]
["4444","CHF",5.6960160532669724,3.8644566601704837,4.1142436528739295E-3,2.7913046833485801E-3,0.32155095350301732]
["4444","EUR",37.213495759930218,-4.2868582888491256,2.6879381536105324E-2,-3.0964062145772278E-3,1.1151963340532232]
["4444","GBP",10.06852920779397,-1.3926086934845048,7.2725185462184571E-3,-1.0058840116539847E-3,1.1383130211716024]
["4444","JPY",12.858454165165732,4.1413149497285699,9.2876868569323704E-3,2.9912799730787724E-3,0.6779305741939321]
["4444","USD",313.48936081127846,111.18273440400435,0.22643398489397759,8.0307508801433294E-2,0.64533809340044335]
["4444","BRL",4.2408048651055905,5.9124596898170561,3.063141735587342E-3,4.2705813193329948E-3,-0.39418338685334531]
["4444","CNY",0.47722003108716821,0.47722003108716821,3.4469697163135021E-4,3.4469697163135021E-4,0]
["4444","DKK",0.81845630132645497,0.78622022751167231,5.9117260404413627E-4,5.6788842421638165E-4,3.9386432436940511E-2]
["4444","HKD",14.154263918960512,13.890237251705411,1.0223652803135161E-2,1.0032945819554818E-2,1.8653507435411054E-2]
["4444","NOK",2.3474578729434801,2.4855786718255186,1.6955734611399586E-3,1.7953383871542339E-3,-5.8838456900122571E-2]
["4444","NTD",3.4499277828311845,3.549515989881348,2.4918896559720355E-3,2.5638224147503802E-3,-2.8866751224698506E-2]
["4444","SEK",2.8491413369539531,4.7218535499716854,2.057940418721311E-3,3.4106041514101577E-3,-0.65729003637982686]
["4444","NZD",2.4694113374785767,0.5326408776807936,1.7836606896023378E-3,3.8472755865961961E-4,0.78430451436063575]
["4444","AUD",7.6696571358945524,10.337888475292946,5.5398085075576637E-3,7.4670772774942957E-3,-0.34789447456665012]
["4444","CLP",2.1481250579250721E-2,2.1481250579250721E-2,1.5515949748910295E-5,1.5515949748910295E-5,0]
["4444","IDR",2.7018657185692563,3.6854186607278963,1.9515629484866915E-3,2.661985182500715E-3,-0.36402732208300481]
["4444","ILS",0.11485816941111759,-2.7465589194514251,8.2962282771196469E-5,-1.9838449358154701E-3,24.912612690356653]
["4444","KOR",3.9799971092280484,-0.29171979085960514,2.8747597780568622E-3,-2.1070978149253239E-4,1.0732964831012619]
["4444","MXN",1.0996944396682637,3.0841892463991663,7.943114672071391E-4,2.2277159882619908E-3,-1.8045874700699129]
["4444","MYR",2.3092280401913503,2.3092280401913503,1.6679599773857005E-3,1.6679599773857005E-3,0]
["4444","PHP",2.4171280747054307,2.4508830959455352,1.7458963855687176E-3,1.770277704123828E-3,-1.3964928707477897E-2]
["4444","PLN",0.41767189143105099,-0.59288808735864995,3.0168523266686602E-4,-4.282442372824471E-4,2.4195067935437633]
["4444","SGD",1.2181306707837229,-0.92916616427932119,8.7985819101905828E-4,-6.7113855686182992E-4,1.7627803704191378]
["4444","THB",0.9003440320241628,0.96590948385766418,6.5032027376990184E-4,6.9767832921271912E-4,-7.2822665005171983E-2]
["4444","TRL",0.27994656168374699,1.8193074389976822,2.0220595479021424E-4,1.3140893588650341E-3,-5.4987668648452157]
["4444","ZAR",2.1893303023931532,3.8114206181167973,1.5813576044083196E-3,2.7529966453528334E-3,-0.74090707736084416]
["4444","COP",0.97869263301964438,0.99530396216951467,7.069116231170179E-4,7.1891001899257987E-4,-1.6972978634382851E-2]
["4444","INR",0.94074672332418507,4.1408275719423742,6.7950321754773788E-4,2.9909279391405505E-3,-3.4016391120773841]
["4444","AED",7.9890637750685348E-2,7.9890637750685348E-2,5.7705165543079242E-5,5.7705165543079242E-5,0]
["4444","CZK",1.5755932115477118E-3,1.5755932115477118E-3,1.1380540907014179E-6,1.1380540907014179E-6,0]
["4444","HUF",8.5949365085030496E-2,8.5960617994248825E-2,6.2081396271138073E-5,6.2089524269706703E-5,-1.3092486730070796E-4]
["4444","QAR",9.5818306494297151E-2,9.5818306494297151E-2,6.9209752156015173E-5,6.9209752156015173E-5,0]
["4444","RUB",0.39795917173970613,0.39795917173970613,2.874466962736124E-4,2.874466962736124E-4,0]
["4444","PKR",6.7968615947225183E-2,6.7968615947225183E-2,4.9093865631770588E-5,4.9093865631770588E-5,0]
["4444","EGP",2.8745188859407012E-2,2.8745188859407012E-2,2.0762706725105963E-5,2.0762706725105963E-5,0]
["4444","MAD",4.5848859722351079E-3,4.5848859722351079E-3,3.3116721993084738E-6,3.3116721993084738E-6,0]
["4444","NGN",1.4563092192160501E-2,1.4563092192160501E-2,1.0518950272875213E-5,1.0518950272875213E-5,0]
["4444","PEN",-8.6629886332756928E-6,5.5612536185593274E-2,-6.2572938113352244E-9,4.0169044799402856E-5,6420.5554836558504]
["4444","RON",-8.71520287489049E-6,-8.71520287489049E-6,-6.295008261249756E-9,-6.295008261249756E-9,0]
["4710","AUD",3.7824328672476875,0.64195071630469491,1.7813037572390444E-2,3.0232108884669538E-3,0.83028100198066046]
["4710","BRL",2.5921690258772023,2.846092137575206,1.2207593861549869E-2,1.3403422601391095E-2,-9.7957775578340067E-2]
["4710","CAD",49.956893809005734,183.21872695556439,0.23526763267242565,0.8628526088289451]
["4710","CHF",3.3265147887125683E-5,-0.11881548614299614,1.5665931160218311E-7,-5.5955116538184216E-4,3572.7708680014694]
["4710","CLP",0.35905573844324168,0.35905573844324168,1.6909416727139059E-3,1.6909416727139059E-3,0]
["4710","COP",0.13380389468567444,0.51113760575505363,6.3013776768031018E-4,2.4071579577304475E-3,-2.8200502829591998]
["4710","EUR",3.9112911615060031,2.3814943156124873,1.8419884466359972E-2,1.1215439694851186E-2,0.39112323340931821]
["4710","GBP",0.72639257589697959,1.2211488337377521,3.4208824586948218E-3,5.7508938876896986E-3,-0.68111414441402718]
["4710","IDR",0.3157584304137725,1.10004379035247,1.4870367782237343E-3,5.1805602522383603E-3,-2.4838144745999764]
["4710","INR",0,0.24173670831992042,0,1.138437936391471E-3]
["4710","JPY",8.5472850000000005,3.0966318601756928,4.0252692959945977E-2,1.4583317565477051E-2,0.6377057907656416]
["4710","KOR",0,1.0584004012114112,0,4.9844443444493269E-3]
["4710","MXN",10.133321406467378,0.20177780475940299,4.7721993035095854E-2,9.5025496647323379E-4,0.98008769319893252]
["4710","NOK",1.58518,-0.14314563345471024,7.4652669036129205E-3,-6.7413187134972351E-4,1.0903024473275655]
["4710","NTD",0,2.2633355180069046,0,1.0658981146840453E-2]
["4710","NZD",3.5767180000000001,-0.86939621316554161,1.6844241353635925E-2,-4.0943456113949972E-3,1.2430709418985622]
["4710","PEN",-1.468106916070192E-3,1.2542905484279629,-6.9139214294301188E-6,5.9069719014205142E-3,855.3591305907272]
["4710","PHP",0.17078275249281447,0.93730775734301552,8.0428647213094087E-4,4.4141691034409111E-3,-4.4883045486835789]
["4710","RUB",4.3388629505959448,4.3388629505959448,2.0433496501593641E-2,2.0433496501593641E-2,0]
["4710","SEK",3.0245060000000001,2.9276539628362914,1.4243647119935086E-2,1.3787530901218143E-2,3.2022431816537522E-2]
["4710","THB",0.31871256968220751,1.8086997072195596,1.5009490393608361E-3,8.5179134627490615E-3,-4.6750184312562189]
["4710","USD",116.14487878161556,0.48180308262565519,0.54697417302295581,2.2690095804791788E-3,0.99585170618214192]
["4710","ZAR",1.8517905732360267,1.7077431324455146,8.7208461365909911E-3,8.0424672822756761E-3,7.7788192073354967E-2]
["4710","CZK",0.10899992570439419,0.10899992570439419,5.1332563990037804E-4,5.1332563990037804E-4,0]
["4710","HUF",9.7047810369413207E-2,9.8954828206868253E-2,4.5703819554806596E-4,4.6601912966693737E-4,-1.9650292265183111E-2]
["4710","MYR",0.31539937434631349,0.31539937434631349,1.4853458350015494E-3,1.4853458350015494E-3,0]
["4710","PLN",0.25235999363059369,0.25235999363059369,1.1884673716842495E-3,1.1884673716842495E-3,0]
["4710","RON",-1.4769556047245437E-3,-1.4769556047245437E-3,-6.955593556602873E-6,-6.955593556602873E-6,0]
["4710","TRL",9.9932879237249417E-2,9.9932879237249417E-2,4.706251756599155E-4,4.706251756599155E-4,0]
["4721","CAD",40.026699999999998,50.273699999999998,0.79630720137510091,1.0001651235243327]
["4721","USD",10.23867027,-8.3363100000005217E-3,0.20369220716437153,-1.6584589001580655E-4,1.0008141985023609]
["4732","CAD",0.3518,33.139099999999999,2.092036524412544E-3,0.19706710513405268]
["4732","USD",167.80976100000001,135.02244402000002,0.9979083262221139,0.80293315663811293,0.19538384885727822]
["4762","AUD",3.6456140483227886,8.7670237754260444E-2,1.606106975459598E-3,3.8623885724299181E-5,0.97595185979859989]
["4762","BRL",4.1257483068502445,4.1553843081405777,1.8176342988560077E-3,1.8306906969733651E-3,-7.183182076600847E-3]
["4762","CAD",836.82510836583958,2170.2825708798246,0.36867057948837106,0.95613686188534386]
["4762","EUR",5.3027581904460561,-0.13754204457973637,2.3361762397117124E-3,-6.0595343964104146E-5,1.0259378307740952]
["4762","MXN",10.236476593540933,2.3722348024315152,4.5097687915095766E-3,1.0451086739053318E-3,0.76825670622562059]
["4762","RUB",11.738332280652893,11.738332280652893,5.1714243763386729E-3,5.1714243763386729E-3,0]
["4762","USD",1381.7730586379819,64.885305046493428,0.60875213847763532,2.858578545579759E-2,0.95304199583218741]
["4762","ZAR",2.9154112437523807,2.9233954569926404,1.2844097792190229E-3,1.2879272938019605E-3,-2.7386233271102789E-3]
["4762","CHF",4.5084712102829834E-2,2.0727974584705003E-2,1.9862462025637713E-5,9.1318894777026871E-6,0.5402438294952765]
["4762","COP",0.94267588226194365,0.96735759487093087,4.1530405852890299E-4,4.2617780167947624E-4,-2.6182607483034026E-2]
["4762","GBP",1.7433315835198699E-3,0.2520282440016296,7.6803989114493757E-7,1.1103323482365806E-4,-143.56701546860782]
["4762","IDR",2.2245829067322207,2.2871997383631171,9.8005934710356261E-4,1.0076457368668537E-3,-2.8147672735145068E-2]
["4762","INR",0,1.6098850234983877E-2,0,7.0924884852203691E-6]
["4762","JPY",0,-0.2805090473227268,0,-1.2358070042873268E-4]
["4762","KOR",0,7.1440229249562892E-2,0,3.1473614322652632E-5]
["4762","NOK",0,-2.9523415544247499E-2,0,-1.3006797487743767E-5]
["4762","NTD",0,0.15237522288473984,0,6.7130229672826509E-5]
["4762","NZD",0,-0.17275258001730165,0,-7.6107651582613123E-5]
["4762","PEN",-1.0343114343662679E-2,2.8685607992883055E-2,-4.5567489797707685E-6,1.2637694084447902E-5,3.7734014185445983]
["4762","PHP",1.2031995201595844,1.2545453782982798,5.300800130192075E-4,5.5270087738510428E-4,-4.2674433689838365E-2]
["4762","SEK",0,-1.9472014425862702E-2,0,-8.5785653064443489E-6]
["4762","THB",2.2453954237948861,2.3458343876473271,9.8922848250520981E-4,1.0334777415636543E-3,-4.4731080676512436E-2]
["4762","CLP",0.4850957549656999,0.4850957549656999,2.1371315380318238E-4,2.1371315380318238E-4,0]
["4762","CZK",0.76792683330522737,0.76792683330522737,3.3831684519143064E-4,3.3831684519143064E-4,0]
["4762","HUF",0.68372172930008968,0.69715706110889297,3.0121955427711328E-4,3.0713860655464683E-4,-1.9650292265183333E-2]
["4762","MYR",2.2220532830918285,2.2220532830918285,9.7894489940825841E-4,9.7894489940825841E-4,0]
["4762","PLN",1.777927916090833,1.777927916090833,7.8328160634874729E-4,7.8328160634874729E-4,0]
["4762","RON",-1.0405455170166252E-2,-1.0405455170166252E-2,-4.5842137730747582E-6,-4.5842137730747582E-6,0]
["4762","TRL",0.70404763122366909,0.70404763122366909,3.1017430714706882E-4,3.1017430714706882E-4,0]
["4773","AUD",18.972581999999999,18.972581999999999,2.7693537175958915E-2,2.7693537175958915E-2,0]
["4773","CAD",113.5398,113.5398,0.16572961298841352,0.16572961298841352]
["4773","CHF",30.890781,30.890781,4.509006691961618E-2,4.509006691961618E-2,0]
["4773","DKK",8.0933290000000007,8.0933290000000007,1.1813516343677758E-2,1.1813516343677758E-2,0]
["4773","EUR",77.560379999999995,77.560379999999995,0.11321185840237773,0.11321185840237773,0]
["4773","GBP",35.163691,35.163691,5.1327066814228661E-2,5.1327066814228661E-2,0]
["4773","HKD",14.342506,14.342506,2.0935196016410092E-2,2.0935196016410092E-2,0]
["4773","ILS",1.340646,1.340646,1.956888621738497E-3,1.956888621738497E-3,0]
["4773","JPY",56.467218000000003,56.467218000000003,8.2422993396785771E-2,8.2422993396785771E-2,0]
["4773","MYR",0.30133300000000002,0.30133300000000002,4.3984401479162029E-4,4.3984401479162029E-4,0]
["4773","NOK",2.2113700000000001,2.2113700000000001,3.2278504478093846E-3,3.2278504478093846E-3,0]
["4773","NZD",1.4648319999999999,1.4648319999999999,2.1381580771944616E-3,2.1381580771944616E-3,0]
["4773","SEK",18.521443000000001,18.521443000000001,2.7035027192023948E-2,2.7035027192023948E-2,0]
["4773","SGD",0.52621200000000001,0.52621200000000001,7.6809111086913173E-4,7.6809111086913173E-4,0]
["4773","USD",304.10202757000002,304.10202757000002,0.44388585622106042,0.44388585622106042,0]
["4773","ZAR",1.592403,1.592403,2.3243684849857814E-3,2.3243684849857814E-3,0]
["4775","AED",0.35121000000000002,0.35121000000000002,1.9484356094207954E-3,1.9484356094207954E-3,0]
["4775","AUD",2.4493960000000001,2.4493960000000001,1.3588708715505989E-2,1.3588708715505989E-2,0]
["4775","BRL",9.3032730000000008,9.3032730000000008,5.1612506470097748E-2,5.1612506470097748E-2,0]
["4775","CAD",3.0485000000000002,3.0485000000000002,1.6912405555990134E-2,1.6912405555990134E-2]
["4775","CHF",2.185025,2.185025,1.212203672297108E-2,1.212203672297108E-2,0]
["4775","CLP",4.5943999999999999E-2,4.5943999999999999E-2,2.5488717758386436E-4,2.5488717758386436E-4,0]
["4775","COP",2.6023000000000001E-2,2.6023000000000001E-2,1.443698637964675E-4,1.443698637964675E-4,0]
["4775","CZK",6.6889999999999996E-3,6.6889999999999996E-3,3.7109096527478427E-5,3.7109096527478427E-5,0]
["4775","DKK",0.94041399999999997,0.94041399999999997,5.2172094336660332E-3,5.2172094336660332E-3,0]
["4775","EUR",14.134558999999999,14.134558999999999,7.8415415503713407E-2,7.8415415503713407E-2,0]
["4775","GBP",2.7011349999999998,2.7011349999999998,1.4985301158431819E-2,1.4985301158431819E-2,0]
["4775","HKD",39.306646999999998,39.306646999999998,0.21806460721999107,0.21806460721999107,0]
["4775","HUF",0.61248400000000003,0.61248400000000003,3.3979261290979367E-3,3.3979261290979367E-3,0]
["4775","IDR",2.2934079999999999,2.2934079999999999,1.2723321699639894E-2,1.2723321699639894E-2,0]
["4775","INR",1.3046E-2,1.3046E-2,7.2376330288157216E-5,7.2376330288157216E-5,0]
["4775","JPY",7.5044170000000001,7.5044170000000001,4.1632850177223811E-2,4.1632850177223811E-2,0]
["4775","KOR",16.703861,16.703861,9.2669336258122639E-2,9.2669336258122639E-2,0]
["4775","MXN",2.8502290000000001,2.8502290000000001,1.5812441782989732E-2,1.5812441782989732E-2,0]
["4775","MYR",3.172831,3.172831,1.7602166518818345E-2,1.7602166518818345E-2,0]
["4775","NOK",0.319525,0.319525,1.7726542185592085E-3,1.7726542185592085E-3,0]
["4775","NTD",9.4166109999999996,9.4166109999999996,5.2241280693783101E-2,5.2241280693783101E-2,0]
["4775","NZD",0.28840100000000002,0.28840100000000002,1.5999851319511596E-3,1.5999851319511596E-3,0]
["4775","PHP",1.438974,1.438974,7.9831103403396244E-3,7.9831103403396244E-3,0]
["4775","PLN",2.2297760000000002,2.2297760000000002,1.2370305399709186E-2,1.2370305399709186E-2,0]
["4775","QAR",0.68739099999999997,0.68739099999999997,3.8134936419673979E-3,3.8134936419673979E-3,0]
["4775","RUB",1.062665,1.062665,5.895431015304659E-3,5.895431015304659E-3,0]
["4775","SEK",1.1567149999999999,1.1567149999999999,6.4171996695742573E-3,6.4171996695742573E-3,0]
["4775","SGD",0.29815700000000001,0.29815700000000001,1.6541092679538624E-3,1.6541092679538624E-3,0]
["4775","THB",3.4021379999999999,3.4021379999999999,1.8874311173838004E-2,1.8874311173838004E-2,0]
["4775","TRL",0.97510399999999997,0.97510399999999997,5.4096619016789247E-3,5.4096619016789247E-3,0]
["4775","USD",45.399892999999999,45.399892999999999,0.2518685919680359,0.2518685919680359,0]
["4775","ZAR",5.9279190000000002,5.9279190000000002,3.2886787020193362E-2,3.2886787020193362E-2,0]
["4777","CAD",301.17251585285698,432.88040641133199,0.4052727347571613,0.58250543092326379]
["4777","MXN",0.62455052773610897,0.14478054457441927,8.4042629073532093E-4,1.9482391038620859E-4,0.76818441720123998]
["4777","NZD",0.73374324535681701,-8.1184176722791986E-3,9.8736144901294832E-4,-1.0924547090986648E-5,1.0110643848834768]
["4777","USD",345.81292043375998,222.58642448665447,0.46534308611022968,0.29952337687944142,0.356338611618502]
["4777","AUD",7.0980309404158595,5.3902353834534686,9.5514638926040389E-3,7.2533691484128852E-3,0.24060131201151602]
["4777","BRL",0.2516975251122936,0.25350551426340506,3.3869672352076564E-4,3.4112964375456351E-4,-7.183182076601069E-3]
["4777","EUR",22.601055846560104,20.060943847238633,3.0413106207240435E-2,2.699500501152096E-2,0.11238908556159677]
["4777","RUB",0.71611474191979119,0.71611474191979119,9.6363965694514246E-4,9.6363965694514246E-4,0]
["4777","ZAR",0.18344438790133516,0.18393147692448411,2.4685190330232576E-4,2.4750735454734645E-4,-2.655240799249281E-3]
["4777","CHF",18.330120748867838,18.328634829200141,2.4665923260912933E-2,2.4663923733414046E-2,8.1064368754324434E-5]
["4777","DKK",4.4806335309251315,4.4806335309251315,6.029363600395206E-3,6.029363600395206E-3,0]
["4777","GBP",17.806099093782944,14.781101219283684,2.3960773627232593E-2,1.9890185852112125E-2,0.16988549027874655]
["4777","HKD",4.3793594084248468,4.3793594084248468,5.8930840980322653E-3,5.8930840980322653E-3,0]
["4777","JPY",14.442303243372331,14.425190364027387,1.9434282424672988E-2,1.9411254482059912E-2,1.1849134488155499E-3]
["4777","SEK",3.2905927569063103,3.2894048371701978,4.4279854746608902E-3,4.4263869507093836E-3,3.6100478663581015E-4]
["4777","SGD",0.40486775413158277,0.40486775413158277,5.4481021107537437E-4,5.4481021107537437E-4,0]
["4777","COP",5.750937015581533E-2,5.9015115421201553E-2,7.738747226389071E-5,7.9413678074280339E-5,-2.6182607483034026E-2]
["4777","IDR",0.13571405000686487,0.13953408467201925,1.8262358381375033E-4,1.8776401268465914E-4,-2.814767273514529E-2]
["4777","INR",0,9.8213474500396581E-4,0,1.321609420038348E-6]
["4777","KOR",0,4.3583194024982858E-3,0,5.8647716183326564E-6]
["4777","NOK",0,-1.8011206871274231E-3,0,-2.4236776866334493E-6]
["4777","NTD",0,9.2958812889395327E-3,0,1.2509000767477277E-5]
["4777","PEN",-6.3099735820793402E-4,1.7500089683517794E-3,-8.4910146684969387E-7,2.3548992126492416E-6,3.7734014185446001]
["4777","PHP",7.3403009325032756E-2,7.6535441179108446E-2,9.8774744582256149E-5,1.0298990087016235E-4,-4.2674433689838365E-2]
["4777","THB",0.13698374913691905,0.14311118027093372,1.8433215419009651E-4,1.9257753065044907E-4,-4.4731080676512436E-2]
["4777","CLP",2.9594001351129471E-2,2.9594001351129471E-2,3.9823161904451693E-5,3.9823161904451693E-5,0]
["4777","CZK",4.6848539715649305E-2,4.6848539715649305E-2,6.3041727948432146E-5,6.3041727948432146E-5,0]
["4777","HUF",4.1711479792549702E-2,4.2531122561286591E-2,5.6129044306797527E-5,5.7231996431991519E-5,-1.9650292265183333E-2]
["4777","MYR",0.13555972648482764,0.13555972648482764,1.8241591839768048E-4,1.8241591839768048E-4,0]
["4777","PLN",0.10846518571312438,0.10846518571312438,1.4595615511402686E-4,1.4595615511402686E-4,0]
["4777","RON",-6.3480055476220561E-4,-6.3480055476220561E-4,-8.5421923752011488E-7,-8.5421923752011488E-7,0]
["4777","TRL",4.2951492228922944E-2,4.2951492228922944E-2,5.7797666789824495E-5,5.7797666789824495E-5,0]
["4787","AUD",18.47749,18.47749,1.2931293242698408E-2,1.2931293242698408E-2,0]
["4787","CAD",370.04571222616613,447.40941222616613,0.25897292424456686,0.31311516385828858]
["4787","CHF",62.657437999999999,62.657437999999999,4.3850203929981534E-2,4.3850203929981534E-2,0]
["4787","DKK",15.318346999999999,15.318346999999999,1.0720397470133088E-2,1.0720397470133088E-2,0]
["4787","EUR",68.421931000000001,68.421931000000001,4.7884428782950322E-2,4.7884428782950322E-2,0]
["4787","GBP",50.412975000000003,50.412975000000003,3.5281034543210348E-2,3.5281034543210348E-2,0]
["4787","HKD",14.972111999999999,14.972111999999999,1.0478088243290823E-2,1.0478088243290823E-2,0]
["4787","JPY",49.375208000000001,49.375208000000001,3.4554763312940683E-2,3.4554763312940683E-2,0]
["4787","SEK",11.249847000000001,11.249847000000001,7.8730969678506638E-3,7.8730969678506638E-3,0]
["4787","SGD",1.384158,1.384158,9.6868963220799701E-4,9.6868963220799701E-4,0]
["4787","USD",766.56300790999626,689.1992512199962,0.53647173097044576,0.48232945168277397,0.10092289334562243]
["4787","ZAR",1.9095000000000001E-2,1.9095000000000001E-2,1.3363451663041144E-5,1.3363451663041144E-5,0]
["4788","CAD",239.58938192257878,360.33678064299602,0.48795154712052813,0.7338676204607314]
["4788","MXN",0.63950312307239487,0.14824681361658915,1.3024222350238362E-3,3.0192181923687422E-4,0.76818437898417136]
["4788","NZD",0.75170725936254235,-8.311472832028181E-3,1.5309389641741794E-3,-1.6927277806279909E-5,1.0110567946877038]
["4788","USD",206.94274501218854,94.988344343977644,0.42146288697675477,0.1934547733673726,0.54099215056617234]
["4788","AUD",3.8455093436241414,2.1005157936868692,7.8318255117590975E-3,4.2779438848914242E-3,0.45377436225203127]
["4788","BRL",0.25772349589481114,0.25957477069124163,5.2488377215239581E-4,5.2865410785681943E-4,-7.183182076600847E-3]
["4788","EUR",10.600593298077357,7.8803141255538094,2.1589336967628308E-2,1.6049173124885307E-2,0.25661574744282734]
["4788","RUB",0.73325947351702681,0.73325947351702681,1.4933679100146246E-3,1.4933679100146246E-3,0]
["4788","ZAR",0.1843032151441481,0.1848019657210635,3.7535486024975451E-4,3.7637062360988438E-4,-2.7061414882281198E-3]
["4788","CHF",7.1757065718516584,7.1741850773069373,1.4614158170621283E-2,1.4611059470624336E-2,2.1203410834680358E-4]
["4788","DKK",1.7536117900533854,1.7536117900533854,3.5714336718054261E-3,3.5714336718054261E-3,0]
["4788","GBP",8.8971119614300633,5.8072148995613588,1.8119999774811508E-2,1.1827066257961353E-2,0.3472921410075247]
["4788","HKD",1.7139755435230559,1.7139755435230559,3.4907098615041222E-3,3.4907098615041222E-3,0]
["4788","JPY",5.6523688153257163,5.6348462310744907,1.1511704259186495E-2,1.1476017485313943E-2,3.1000426234953915E-3]
["4788","SEK",1.287858561729716,1.2866422016280552,2.6228732368093807E-3,2.6203959784738967E-3,9.4448267675228958E-4]
["4788","SGD",0.1584554644242433,0.1584554644242433,3.2271291989265262E-4,3.2271291989265262E-4,0]
["4788","COP",5.8886220341868287E-2,6.0428015135238877E-2,1.1992861323537269E-4,1.2306865704169906E-4,-2.6182607483034026E-2]
["4788","IDR",0.13896322339366571,0.14287471472797147,2.8301471168578788E-4,2.9098091716955085E-4,-2.8147672735145068E-2]
["4788","INR",0,1.0056483464001209E-3,0,2.0481194222693377E-6]
["4788","KOR",0,4.4626633183497298E-3,0,9.0887311156820845E-6]
["4788","NOK",0,-1.8442418923580884E-3,0,-3.7560123800954366E-6]
["4788","NTD",0,9.5184369498261829E-3,0,1.9385400131537246E-5]
["4788","PEN",-6.4610426735497615E-4,1.7919064916100094E-3,-1.3158662304947717E-6,3.6494252702691334E-6,3.7734014185445988]
["4788","PHP",7.516037419917751E-2,7.8367800604043747E-2,1.5307281390499006E-4,1.5960510955169552E-4,-4.2674433689838365E-2]
["4788","THB",0.14026332079583986,0.14653745071431412,2.8566251073976786E-4,2.9844050355392352E-4,-4.4731080676512436E-2]
["4788","CLP",3.0302520782936077E-2,3.0302520782936077E-2,6.1714595943419706E-5,6.1714595943419706E-5,0]
["4788","CZK",4.7970155557537961E-2,4.7970155557537961E-2,9.7696782019650826E-5,9.7696782019650826E-5,0]
["4788","HUF",4.2710107643234116E-2,4.3549373741101106E-2,8.6984084749360029E-5,8.8693347437104422E-5,-1.9650292265183333E-2]
["4788","MYR",0.13880520516293224,0.13880520516293224,2.8269288924298629E-4,2.8269288924298629E-4,0]
["4788","PLN",0.11106198534290233,0.11106198534290233,2.2619060635941941E-4,2.2619060635941941E-4,0]
["4788","RON",-6.4999851745181235E-4,-6.4999851745181235E-4,-1.323797322199994E-6,-1.323797322199994E-6,0]
["4788","TRL",4.3979807613118899E-2,4.3979807613118899E-2,8.9569975909112551E-5,8.9569975909112551E-5,0]
["4798","AUD",13.353793,-0.17974761999999919,2.463711716538507E-2,-3.3162586645899727E-4,1.0134604168268895]
["4798","CAD",431.44260000000003,539.10320000000002,0.79599121285902552,0.99461993327543874]
["4798","EUR",0.65696600000000005,0.65696600000000005,1.2120712306738894E-3,1.2120712306738894E-3,0]
["4798","GBP",27.781243,0.18043001000000164,5.1255080769264119E-2,3.3288484376848139E-4,0.99350532983711337]
["4798","USD",68.784699000000003,2.258496499999985,0.12690451982060419,4.1668193365069937E-3,0.96716571370036841]
["4804","AUD",1.3944529999999999,0.1985026200000001,2.0038584016876373E-2,2.8525245586908179E-3,0.85764839689828187]
["4804","BRL",0.87023978604155849,0.91006676524452867,1.2505529456655973E-2,1.3077851556358943E-2,-4.5765523298044508E-2]
["4804","CAD",17.87471419965728,60.548310377473605,0.25686341688639602,0.87009200351601135]
["4804","CHF",0,-3.7384970000000003E-2,0,-5.3722991188186544E-4]
["4804","CLP",0.10866782872898441,0.10866782872898441,1.5615796415635998E-3,1.5615796415635998E-3,0]
["4804","COP",4.1990017027258068E-2,0.10033776702725808,6.0340540991398091E-4,1.4418748962076737E-3,-1.3895624277104539]
["4804","EUR",1.7704167677650828,0.70475860798492707,2.5441262735816355E-2,1.0127529990414021E-2,0.60192502645883117]
["4804","GBP",0.54164131053350828,0.38650070591818253,7.7834999875483315E-3,5.554096744833658E-3,0.28642683192409135]
["4804","IDR",9.9090552638406271E-2,0.22147909770226648,1.4239521621190639E-3,3.1827013942304534E-3,-1.2351182005258483]
["4804","INR",0,3.6904550000000001E-2,0,5.3032617505216386E-4]
["4804","JPY",5.130979,1.09472171,7.3733251518931314E-2,1.5731382098165787E-2,0.78664467151395479]
["4804","KOR",0,0.16550757000000002,0,2.3783787240402141E-3]
["4804","MXN",2.1936332943055299,0.10098839620716725,3.1522973574698222E-2,1.4512245748884477E-3,0.95396295430538736]
["4804","NOK",0.72858800000000001,-4.6073579999999961E-2,1.0469963384702049E-2,-6.6208707198326105E-4,1.0632368087314092]
["4804","NTD",0,0.35293587999999998,0,5.0717631099436106E-3]
["4804","NZD",1.6466689999999999,-0.2717326699999999,2.3662981186519591E-2,-3.9048558380419709E-3,1.1650196062475215]
["4804","PEN",-4.607177881364222E-4,0.19411727758305231,-6.6206118855502093E-6,2.7895062622944672E-3,422.33662424506309]
["4804","PHP",5.359463341468082E-2,0.17271087341468083,7.7016619745073629E-4,2.4818917149220391E-3,-2.2225404375537963]
["4804","RUB",1.4423906596479186,1.4423906596479186,2.0727458306958036E-2,2.0727458306958036E-2,0]
["4804","SEK",0.68957999999999997,0.65957396000000001,9.9094101890544965E-3,9.4782170591650328E-3,4.351350097160589E-2]
["4804","THB",0.10001761353206619,0.33232526353206615,1.4372742228886738E-3,4.7755841998388549E-3,-2.3226673962333733]
["4804","USD",34.024362358702817,1.3560787541464483,0.48893727056093855,1.9487138002115989E-2,0.9601438892564701]
["4804","ZAR",0.60408764285240246,0.58232750593291782,8.6808669670865035E-3,8.3681692053979954E-3,3.6021489889673686E-2]
["4804","CZK",3.4206095024731729E-2,3.4206095024731729E-2,4.9154880734047243E-4,4.9154880734047243E-4,0]
["4804","HUF",3.0455310881963907E-2,3.1053766641821516E-2,4.3764924731656292E-4,4.4624918293597086E-4,-1.9650292265183333E-2]
["4804","MYR",9.8977874525248477E-2,9.8977874525248477E-2,1.4223329538435785E-3,1.4223329538435785E-3,0]
["4804","PLN",7.9195007398255371E-2,7.9195007398255371E-2,1.1380489765284928E-3,1.1380489765284928E-3,0]
["4804","RON",-4.6349466236820727E-4,-4.6349466236820727E-4,-6.6605161545344811E-6,-6.6605161545344811E-6,0]
["4804","TRL",3.1360696268314885E-2,3.1360696268314885E-2,4.506598264698554E-4,4.506598264698554E-4,0]
["4825","AUD",0.34616725707380092,7.0342486948026722E-2,6.5094483759402348E-3,1.3227443614801787E-3,0.79679624369259716]
["4825","BRL",0.53782296323392087,0.5654333823448997,1.0113408310653806E-2,1.0632604144945762E-2,-5.1337374932743263E-2]
["4825","CAD",4.3917858882957788,-0.67638779867295307,8.2584655058665399E-2,-1.2719029219562406E-2]
["4825","CHF",1.9311477433835584,1.9179631602364287,3.6313967554674732E-2,3.6066040110351957E-2,6.827330116145891E-3]
["4825","CLP",3.9342808429345046E-2,3.9342808429345046E-2,7.3981572549690561E-4,7.3981572549690561E-4,0]
["4825","COP",1.9341073120255084E-2,6.0705795115298319E-2,3.6369620303154399E-4,1.1415326878798163E-3,-2.1386983926824472]
["4825","DKK",0.43061511999307239,0.43061511999307239,8.0974350872723248E-3,8.0974350872723248E-3,0]
["4825","EUR",6.3000177356392397,5.4985246286956642,0.11846770420839801,0.10339615166635949,0.12722076993680886]
["4825","GBP",1.206935174323952,1.1380393986898432,2.2695624874461293E-2,2.1400084971000752E-2,5.7083244485520823E-2]
["4825","HKD",0.98846458395269421,0.98846458395269421,1.8587428617818511E-2,1.8587428617818511E-2,0]
["4825","IDR",4.5642220694070743E-2,0.13069231805204035,8.5827204422162689E-4,2.4575833794423449E-3,-1.863408398290713]
["4825","INR",0,2.6630098314298967E-2,0,5.0076154425600546E-4]
["4825","JPY",2.3267625561384984,1.799408268877164,4.3753244805083538E-2,3.3836693084460918E-2,0.22664722958948291]
["4825","KOR",0,0.1145974050627557,0,2.1549290899967599E-3]
["4825","MXN",1.1506566533615663,3.4743738093876972E-2,2.1637344175195684E-2,6.533332222725609E-4,0.96980529509617364]
["4825","NOK",0.45567099999999999,0.22186355618264669,8.5685944880705238E-3,4.1719987548260729E-3,0.51310582375738922]
["4825","NTD",0.29068899999999998,0.53598926863409635,5.4662161145711098E-3,1.0078926885588658E-2,-0.84385810482713963]
["4825","NZD",0.404727,-9.2626333436885214E-2,7.6106259590215724E-3,-1.7417774888844738E-3,1.2288612655861488]
["4825","PEN",-2.1221178410964323E-4,0.13623948031953587,-3.9905035071915941E-6,2.5618941300270758E-3,642.99771417568957]
["4825","PHP",2.4686289673417079E-2,0.10729614763808454,4.6420949682238693E-4,2.0176337296928977E-3,-3.3463861543204763]
["4825","RUB",0.45473566749235961,0.45473566749235961,8.5510061733226443E-3,8.5510061733226443E-3,0]
["4825","SEK",0.68744300000000003,0.58449362984646558,1.292691503444956E-2,1.0991019606283389E-2,0.14975695461810568]
["4825","THB",4.6069235346614612E-2,0.20759815994153213,8.6630177487842259E-4,3.9037473286836232E-3,-3.5062210904871778]
["4825","USD",30.756431410571235,38.555482933164775,0.57835453355017064,0.72501058558919229,-0.25357465625589271]
["4825","ZAR",0.20567774086948695,0.19023204886041625,3.8676351067614208E-3,3.5771889923206113E-3,7.5096565840208185E-2]
["4825","CNY",1.2560885133654543E-2,1.2560885133654543E-2,2.3619921197864095E-4,2.3619921197864095E-4,0]
["4825","CZK",1.5755711282571278E-2,1.5755711282571278E-2,2.9627582367864274E-4,2.9627582367864274E-4,0]
["4825","HUF",1.4028058009259357E-2,1.4303713449054248E-2,2.6378843625438813E-4,2.689719561229625E-4,-1.9650292265183333E-2]
["4825","MYR",4.5590319890500636E-2,4.5590319890500636E-2,8.5729608362857348E-4,8.5729608362857348E-4,0]
["4825","PLN",3.6478109257599887E-2,3.6478109257599887E-2,6.8594693522279178E-4,6.8594693522279178E-4,0]
["4825","RON",-2.1349084354721959E-4,-2.1349084354721959E-4,-4.0145553815630849E-6,-4.0145553815630849E-6,0]
["4825","TRL",1.444508867986035E-2,1.444508867986035E-2,2.7163042467469144E-4,2.7163042467469144E-4,0]
["4835","CAD",2.9188000000000001,-5.1000000000000004E-3,0.27110520791729747,-4.7370034273613035E-4]
["4835","EUR",-1.2999999999999999E-5,-1.2999999999999999E-5,-1.2074714618764106E-6,-1.2074714618764106E-6,0]
["4835","USD",7.8474789999999999,10.771388980000001,0.7288928415518795,1.0004726767784662,-0.37259226561804137]
["4841","AUD",0.10230971425225906,3.1717699123935003E-2,8.2557102022383557E-3,2.5594063492677083E-3,0.68998350395417452]
["4841","BRL",0.11228649256911298,0.12483235681212107,9.0607695373943302E-3,1.0073136937537003E-2,-0.11173084095832841]
["4841","CAD",1.2798015305936723,-1.1105598819943781,0.10327143057902879,-8.9614760582474862E-2]
["4841","CHF",1.0229136163264179E-6,-6.0844097091530009E-3,8.2542292684861766E-8,-4.9097120129375606E-4,5949.116841971364]
["4841","CLP",1.902757193902364E-2,1.902757193902364E-2,1.5353978938256411E-3,1.5353978938256411E-3,0]
["4841","COP",8.4193914980172039E-3,2.6147401494049663E-2,6.7938862692390651E-4,2.1099205569492813E-3,-2.1056165401273321]
["4841","EUR",0.20945424211226607,6.7999095801921802E-2,1.6901557551463459E-2,5.4870725918630316E-3,0.67535106896772834]
["4841","GBP",6.4881039553931499E-2,5.9110508193828092E-2,5.2354662906840778E-3,4.7698229745031786E-3,8.8940180363582644E-2]
["4841","IDR",1.9868583427247594E-2,5.7431609134678617E-2,1.6032619004282874E-3,4.6343470405466663E-3,-1.8905739226439984]
["4841","INR",0,1.1212855262022193E-2,0,9.0480248390347406E-4]
["4841","JPY",0.23150999999999999,6.3271595613700826E-2,1.8681309813921212E-2,5.1055949206543277E-3,0.72670037746230909]
["4841","KOR",0,5.0457830886101847E-2,0,4.071609741789604E-3]
["4841","MXN",0.45569788349405888,1.4661674052347806E-2,3.6771773759667774E-2,1.1830991117560323E-3,0.96782588951274129]
["4841","NOK",0.109458,-6.2497998479895357E-3,8.8325290899407705E-3,-5.0431708019217398E-4,1.0570976981855098]
["4841","NTD",0,0.10862044719608731,0,8.7649441760475847E-3]
["4841","NZD",0.12875500000000001,-4.1265069531879278E-2,1.0389668027693947E-2,-3.3298153359165371E-3,1.320492948094282]
["4841","PEN",-9.2378229470662797E-5,5.9234868355833775E-2,-7.454305752680051E-6,4.7798580084755238E-3,642.22108309778127]
["4841","PHP",1.0746225718793851E-2,4.8117880689689349E-2,8.6714859825975585E-4,3.8827913988742756E-3,-3.477654010704148]
["4841","RUB",0.19412722980548489,0.19412722980548489,1.5664770089043857E-2,1.5664770089043857E-2,0]
["4841","SEK",0.10358199999999999,9.9437668205259289E-2,8.3583751593693002E-3,8.0239552801881203E-3,4.0010154223134364E-2]
["4841","THB",2.00544678149857E-2,9.1698746644747323E-2,1.6182615282495764E-3,7.3994760296263356E-3,-3.5724846697864221]
["4841","USD",9.1809367196701164,12.294893466407048,0.74084023688895928,0.99211573571381695,-0.33917636531197237]
["4841","ZAR",8.6909610094136516E-2,7.9821915861677792E-2,7.013024715889847E-3,6.441095158536368E-3,8.1552479924621224E-2]
["4841","CZK",6.85864226834301E-3,6.85864226834301E-3,5.5344659460831547E-4,5.5344659460831547E-4,0]
["4841","HUF",6.1065749352429248E-3,6.2265709174596905E-3,4.9275978690855227E-4,5.0244266073783475E-4,-1.9650292265183111E-2]
["4841","MYR",1.9845990410738035E-2,1.9845990410738035E-2,1.6014387949855587E-3,1.6014387949855587E-3,0]
["4841","PLN",1.5879340357052976E-2,1.5879340357052976E-2,1.281356644856848E-3,1.281356644856848E-3,0]
["4841","RON",-9.293501874948061E-5,-9.293501874948061E-5,-7.499234926446477E-6,-7.499234926446477E-6,0]
["4841","TRL",6.2881131808531611E-3,6.2881131808531611E-3,5.0740871010547918E-4,5.0740871010547918E-4,0]
["4853","CAD",0.67069999999999996,0.67069999999999996,3.7907839920058371E-3,3.7907839920058371E-3]
["4853","EUR",1.4456880000000001,1.4456880000000001,8.1710018306768075E-3,8.1710018306768075E-3,0]
["4853","GBP",1.8002670000000001,1.8002670000000001,1.017507577894196E-2,1.017507577894196E-2,0]
["4853","USD",173.01237900999999,173.01237900999999,0.97786276542411621,0.97786276542411621,0]
["4855","AUD",2.1353768871248069E-2,-1.0236057515387268E-3,3.0604257714384501E-5,-1.4670334968454897E-6,1.0479356013315742]
["4855","CAD",97.643586341462765,368.31909659222782,0.13994295332916667,0.52787555307930956]
["4855","EUR",0.8133388748177991,-17.99772016722839,1.1656786529879017E-3,-2.5794363027449956E-2,23.128193701868938]
["4855","GBP",1.256568676077171,1.2581428210175647,1.8009163548767498E-3,1.803172422071542E-3,-1.2527329149314426E-3]
["4855","HKD",0.83403980343686646,0.83403980343686646,1.1953472589471077E-3,1.1953472589471077E-3,0]
["4855","ILS",1.3060000000000001E-3,1.3060000000000001E-3,1.8717614120476369E-6,1.8717614120476369E-6,0]
["4855","JPY",1.1017000000000001E-2,9.2527630217834542E-3,1.5789583060129262E-5,1.3261075634759232E-5,0.16013769431029745]
["4855","NOK",0,18.600226265074955,0,2.6657875787383031E-2]
["4855","NTD",0.76568353388499011,0.76664188444566905,1.0973789376463963E-3,1.0987524472931751E-3,-1.2516274913427772E-3]
["4855","PLN",3.9491240116915476,3.9491240116915476,5.6598912224157727E-3,5.6598912224157727E-3,0]
["4855","USD",589.23034971044376,319.53016354409561,0.84448593521848625,0.45795117159809245,0.45771604653236664]
["4855","BRL",0.37526818252270022,0.37545457554589112,5.3783499480493087E-4,5.381021336014726E-4,-4.9669285026476828E-4]
["4855","MXN",0.19178049894432994,0.14231904197553338,2.748601359167223E-4,2.0397189201331643E-4,0.25790660281447197]
["4855","RUB",7.3827208319219698E-2,7.3827208319219698E-2,1.0580928000851278E-4,1.0580928000851278E-4,0]
["4855","ZAR",0.12652732252152549,0.12657753852837045,1.8133917294448491E-4,1.8141114261054886E-4,-3.9687875981431198E-4]
["4855","CNY",0.69131217426354363,-3.2649873845379618E-3,9.9078977906987171E-4,-4.6793854496175316E-6,1.0047228842570524]
["4855","COP",1.2900359087764143E-2,1.3055592548096677E-2,1.8488816494666904E-5,1.8711297352943369E-5,-1.2033266615017801E-2]
["4855","HUF",2.4615136418703918E-2,2.4699636756279231E-2,3.5278455207364821E-5,3.5399561234300859E-5,-3.4328608274989403E-3]
["4855","IDR",7.3039973560249175E-2,7.3433796614715191E-2,1.0468101381857124E-4,1.052454416872728E-4,-5.3918838585169659E-3]
["4855","INR",0.74384366111621136,0.74394491341863234,1.0660779950027286E-3,1.0662231099740553E-3,-1.36120407706386E-4]
["4855","KOR",0.33296716532449366,0.33341648236213395,4.77209105308785E-4,4.7785306724816524E-4,-1.3494334710222322E-3]
["4855","MYR",0.12573749522400895,0.12573749522400895,1.8020719112390811E-4,1.8020719112390811E-4,0]
["4855","PHP",9.0646464955341038E-2,9.0969400213476673E-2,1.2991466710714837E-4,1.3037749846608245E-4,-3.5625797243690194E-3]
["4855","THB",0.28214007481711578,0.28277177684517324,4.0436363310483194E-4,4.052689895213941E-4,-2.2389659762687142E-3]
["4855","TRL",5.9445750704975521E-2,5.9445750704975521E-2,8.5197750597072578E-5,8.5197750597072578E-5,0]
["4855","CHF",2.8355633090346725E-4,1.3036677281854831E-4,4.0639341372658562E-7,1.8684187961327677E-7,0.54024382949527638]
["4855","NZD",0,-1.0865121558742094E-3,0,-1.5571910620873139E-6]
["4855","PEN",-6.5052107834574088E-5,1.8041560814772398E-4,-9.3232791131024146E-8,2.5857195517765464E-7,3.7734014185445988]
["4855","SEK",0,-1.224675218797826E-4,0,-1.7552065978842015E-7]
["4855","CLP",3.0509670795100313E-3,3.0509670795100313E-3,4.3726511859529484E-6,4.3726511859529484E-6,0]
["4855","CZK",4.8298082675497728E-3,4.8298082675497728E-3,6.9220893895775754E-6,6.9220893895775754E-6,0]
["4855","RON",-6.5444194979070533E-5,-6.5444194979070533E-5,-9.3794731090617098E-8,-9.3794731090617098E-8,0]
["5014","AUD",25.097359000000001,25.097359000000001,2.3208470337054816E-2,2.3208470337054816E-2,0]
["5014","BRL",5.2469999999999999E-3,5.2469999999999999E-3,4.8520979382143997E-6,4.8520979382143997E-6,0]
["5014","CAD",237.39709999999999,237.39709999999999,0.2195300132357686,0.2195300132357686]
["5014","CHF",30.965692000000001,30.965692000000001,2.8635138233005938E-2,2.8635138233005938E-2,0]
["5014","DKK",6.5834000000000004E-2,6.5834000000000004E-2,6.0879172034382858E-5,6.0879172034382858E-5,0]
["5014","EUR",104.468189,104.468189,9.6605657414883223E-2,9.6605657414883223E-2,0]
["5014","GBP",38.693807,38.693807,3.5781616383908123E-2,3.5781616383908123E-2,0]
["5014","HKD",56.069876000000001,56.069876000000001,5.1849919903856886E-2,5.1849919903856886E-2,0]
["5014","JPY",28.363679999999999,42.085774840000006,2.6228960024427865E-2,3.8918296422588053E-2,-0.48379106096247071]
["5014","KOR",3.1000000000000001E-5,3.1000000000000001E-5,2.8666864128958722E-8,2.8666864128958722E-8,0]
["5014","MXN",4.1051679999999999,4.1051679999999999,3.7962030091144906E-3,3.7962030091144906E-3,0]
["5014","MYR",6.0217390000000002,6.0217390000000002,5.5685281849371538E-3,5.5685281849371538E-3,0]
["5014","NOK",1.79477,1.79477,1.6596912171848788E-3,1.6596912171848788E-3,0]
["5014","NTD",3.4600000000000001E-4,3.4600000000000001E-4,3.199591931812812E-7,3.199591931812812E-7,0]
["5014","NZD",1.962496,1.962496,1.8147937479233863E-3,1.8147937479233863E-3,0]
["5014","PHP",1.3899999999999999E-4,1.3899999999999999E-4,1.2853851980404072E-7,1.2853851980404072E-7,0]
["5014","SEK",14.472307000000001,14.472307000000001,1.3383085754889619E-2,1.3383085754889619E-2,0]
["5014","SGD",0.93253299999999995,0.93253299999999995,8.6234828408936323E-4,8.6234828408936323E-4,0]
["5014","USD",522.68856700000003,508.96647216000002,0.48334974619190768,0.47066040979374746,2.6252907957713179E-2]
["5014","ZAR",8.2830209999999997,8.2830209999999997,7.659620567235864E-3,7.659620567235864E-3,0]
["5025","CAD",0.29139999999999999,0.29139999999999999,3.5662927811331607E-3,3.5662927811331607E-3]
["5025","USD",81.418095399999984,81.418095399999984,0.9964336509218632,0.9964336509218632,0]
["5026","AUD",6.8190010000000001,6.8190010000000001,4.036492993113279E-2,4.036492993113279E-2,0]
["5026","CAD",3.9251999999999998,3.9251999999999998,2.3235137077364031E-2,2.3235137077364031E-2]
["5026","CHF",8.1984329999999996,8.1984329999999996,4.8530448021651081E-2,4.8530448021651081E-2,0]
["5026","EUR",50.326813000000001,50.326813000000001,0.29790848841380468,0.29790848841380468,0]
["5026","GBP",31.976728999999999,31.976728999999999,0.18928556037927283,0.18928556037927283,0]
["5026","HKD",3.082897,3.082897,1.8249142563536724E-2,1.8249142563536724E-2,0]
["5026","KOR",7.7573210000000001,7.7573210000000001,4.5919295013786464E-2,4.5919295013786464E-2,0]
["5026","NOK",3.453309,3.453309,2.0441788440205572E-2,2.0441788440205572E-2,0]
["5026","SEK",12.561691,12.561691,7.4358660019486919E-2,7.4358660019486919E-2,0]
["5026","USD",40.832372999999997,40.832372999999997,0.24170635479696778,0.24170635479696778,0]
["5027","AUD",2.68255,2.68255,2.5462831129285175E-2,2.5462831129285175E-2,0]
["5027","CAD",8.218,8.218,7.8005459812665393E-2,7.8005459812665393E-2]
["5027","EUR",32.123013,32.123013,0.30491243607121299,0.30491243607121299,0]
["5027","GBP",9.9890460000000001,9.9890460000000001,9.481627236795645E-2,9.481627236795645E-2,0]
["5027","JPY",20.286201999999999,20.286201999999999,0.1925571324972758,0.1925571324972758,0]
["5027","USD",32.052765000000001,32.052765000000001,0.30424564031300899,0.30424564031300899,0]
["5044","CAD",0.11120531023299986,0.11120531023299986,2.2479842938290494E-3,2.2479842938290494E-3]
["5044","USD",49.357721878226066,49.357721878226066,0.99775256531327894,0.99775256531327894,0]
["5056","CAD",1.7676913264432501,1.7676913264432501,6.2749954790959669E-2,6.2749954790959669E-2]
["5056","CHF",0.62892546564563279,0.62892546564563279,2.2325755603244284E-2,2.2325755603244284E-2,0]
["5056","EUR",3.1066018274309344,3.1066018274309344,0.110278939149992,0.110278939149992,0]
["5056","GBP",2.3563945299032869,2.3563945299032869,8.3647890335362185E-2,8.3647890335362185E-2,0]
["5056","JPY",3.2311612115865693,3.2311612115865693,0.11470057974279986,0.11470057974279986,0]
["5056","USD",14.154060282476562,14.154060282476562,0.50244441976246568,0.50244441976246568,0]
["5056","AUD",0.81289212043289027,0.81289212043289027,2.8856250547840651E-2,2.8856250547840651E-2,0]
["5056","DKK",0.73015863032784789,0.73015863032784789,2.59193561443163E-2,2.59193561443163E-2,0]
["5056","HKD",0.69643708891027267,0.69643708891027267,2.4722300319138978E-2,2.4722300319138978E-2,0]
["5056","ILS",7.3262667675187798E-2,7.3262667675187798E-2,2.600696748189156E-3,2.600696748189156E-3,0]
["5056","NOK",0.18207500522402864,0.18207500522402864,6.4633446888943229E-3,6.4633446888943229E-3,0]
["5056","NZD",0.11621757194580473,0.11621757194580473,4.1255208284513081E-3,4.1255208284513081E-3,0]
["5056","SEK",0.25958721371177956,0.25958721371177956,9.2148927140466436E-3,9.2148927140466436E-3,0]
["5056","SGD",5.493356266158466E-2,5.493356266158466E-2,1.9500455322460689E-3,1.9500455322460689E-3,0]
["5068","CAD",9.390178489853282E-3,9.390178489853282E-3,3.2002516835434808E-3,3.2002516835434808E-3]
["5068","CHF",0.25771279013007586,0.25771279013007586,8.7830683024359577E-2,8.7830683024359577E-2,0]
["5068","DKK",0.25852904493876488,0.25852904493876488,8.8108869517675992E-2,8.8108869517675992E-2,0]
["5068","EUR",1.3803370856150712,1.3803370856150712,0.47043047018440159,0.47043047018440159,0]
["5068","GBP",0.75742900442167904,0.75742900442167904,0.25813816523129951,0.25813816523129951,0]
["5068","NOK",5.7942999808576374E-2,5.7942999808576374E-2,1.9747460912199706E-2,1.9747460912199706E-2,0]
["5068","SEK",0.11840627572858675,0.11840627572858675,4.0353853087242438E-2,4.0353853087242438E-2,0]
["5068","USD",9.4469271445242614E-2,9.4469271445242614E-2,3.2195921016032518E-2,3.2195921016032518E-2,0]
["5080","CAD",0.27995939253151947,0.27995939253151947,1.1687717038216841E-2,1.1687717038216841E-2]
["5080","AUD",2.1144779079907305,2.1144779079907305,8.827501463225236E-2,8.827501463225236E-2,0]
["5080","CHF",1.2908515768745152,1.2908515768745152,5.389034399746654E-2,5.389034399746654E-2,0]
["5080","DKK",1.0003184277231845,1.0003184277231845,4.176119481337371E-2,4.176119481337371E-2,0]
["5080","EUR",5.4437753408116887,5.4437753408116887,0.22726619467095091,0.22726619467095091,0]
["5080","GBP",3.4454484370667648,3.4454484370667648,0.14384024067943726,0.14384024067943726,0]
["5080","HKD",1.9897996193545138,1.9897996193545138,8.3069957765924268E-2,8.3069957765924268E-2,0]
["5080","ILS",0.1532261394931827,0.1532261394931827,6.3968697212151435E-3,6.3968697212151435E-3,0]
["5080","JPY",6.2094561969370226,6.2094561969370226,0.25923176334521852,0.25923176334521852,0]
["5080","NOK",0.11289211716167818,0.11289211716167818,4.7130089449753552E-3,4.7130089449753552E-3,0]
["5080","NZD",0.37266137223883533,0.37266137223883533,1.5557830121062039E-2,1.5557830121062039E-2,0]
["5080","SEK",0.64376006207173775,0.64376006207173775,2.6875631419125454E-2,2.6875631419125454E-2,0]
["5080","SGD",0.18937532395191964,0.18937532395191964,7.9060222997215258E-3,7.9060222997215258E-3,0]
["5080","USD",0.70733873271151715,0.70733873271151715,2.9529907474607556E-2,2.9529907474607556E-2,0]
["5092","CAD",3.2292059824616604,3.2292059824616604,0.4983111865903832,0.4983111865903832]
["5092","USD",0.1214362618809971,0.1214362618809971,1.8739296310509867E-2,1.8739296310509867E-2,0]
["5092","BRL",0.33715833731555428,0.33715833731555428,5.2028198897513124E-2,5.2028198897513124E-2,0]
["5092","COP",6.7287748806739408E-3,6.7287748806739408E-3,1.0383431138487325E-3,1.0383431138487325E-3,0]
["5092","EUR",6.0959409306238485E-2,6.0959409306238485E-2,9.406880747224431E-3,9.406880747224431E-3,0]
["5092","GBP",1.3156447964115612E-2,1.3156447964115612E-2,2.0302220520833315E-3,2.0302220520833315E-3,0]
["5092","HKD",0.44113794099435721,0.44113794099435721,6.8073691186265634E-2,6.8073691186265634E-2,0]
["5092","HUF",1.960767901209157E-2,1.960767901209157E-2,3.0257363103701326E-3,3.0257363103701326E-3,0]
["5092","IDR",5.699291830525665E-2,5.699291830525665E-2,8.7947962756749921E-3,8.7947962756749921E-3,0]
["5092","INR",0.71794727537135128,0.71794727537135128,0.11078920348924452,0.11078920348924452,0]
["5092","KOR",0.3213751512974109,0.3213751512974109,4.9592634800458453E-2,4.9592634800458453E-2,0]
["5092","MXN",0.12296377189283851,0.12296377189283851,1.8975012251414056E-2,1.8975012251414056E-2,0]
["5092","MYR",0.10787116934884564,0.10787116934884564,1.6646014744509611E-2,1.6646014744509611E-2,0]
["5092","NTD",0.40760230318387974,0.40760230318387974,6.2898678021677965E-2,6.2898678021677965E-2,0]
["5092","PHP",8.0186709719002575E-2,8.0186709719002575E-2,1.2373919373949134E-2,1.2373919373949134E-2,0]
["5092","PLN",1.9765932514822948E-2,1.9765932514822948E-2,3.0501570166231421E-3,3.0501570166231421E-3,0]
["5092","THB",0.25868700753639856,0.25868700753639856,3.9918986395135803E-2,3.9918986395135803E-2,0]
["5092","TRL",5.3102302956500959E-2,5.3102302956500959E-2,8.1944204676482509E-3,8.1944204676482509E-3,0]
["5092","ZAR",0.10442450409182311,0.10442450409182311,1.6114146581458128E-2,1.6114146581458128E-2,0]
["5093","BRL",0.40558300000000003,0.40558300000000003,2.5449414971484294E-3,2.5449414971484294E-3,0]
["5093","CAD",32.649700000000003,139.01779999999999,0.2048694752971576,0.87230522004689759]
["5093","EUR",3.2382209999999998,-3.6978700000000184E-2,2.0319103610943957E-2,-2.3203297017035499E-4,1.0114194491358064]
["5093","GBP",2.326689,5.3379459999999962E-2,1.4599446690464792E-2,3.3494402588218588E-4,0.97705775890116819]
["5093","MXN",2.8158259999999999,5.6952220000000206E-2,1.7668670620192346E-2,3.573622859753176E-4,0.97977424031172378]
["5093","RUB",1.7637529999999999,1.7637529999999999,1.1067150744533259E-2,1.1067150744533259E-2,0]
["5093","USD",115.91473979000001,17.854086770000009,0.72733874798187603,0.11203035214656873,0.84597224820289607]
["5093","ZAR",0.25377899999999998,0.25377899999999998,1.5924057670189114E-3,1.5924057670189114E-3,0]
["5213","CAD",69.427855949207697,139.73168485512033,0.49788630909638837,1.002054461932862]
["5213","EUR",37.255451000000001,-0.28084481000000239,0.267169117330679,-2.0140156133018733E-3,1.0075383548571188]
["5213","USD",32.761964223717698,-5.6126160965871488E-3,0.23494508397361613,-4.0249618463648438E-5,1.0001713150059703]
["5218","CAD",2.1516000000000002,2.1516000000000002,2.395371975684236E-3,2.395371975684236E-3]
["5218","CHF",106.449512,106.449512,0.11851002875537403,0.11851002875537403,0]
["5218","CNY",45.862538000000001,45.862538000000001,5.1058671806540869E-2,5.1058671806540869E-2,0]
["5218","DKK",36.870443999999999,36.870443999999999,4.104779154519194E-2,4.104779154519194E-2,0]
["5218","EUR",495.98638599999998,495.98638599999998,0.55218065130382221,0.55218065130382221,0]
["5218","GBP",63.254174999999996,63.254174999999996,7.042074648634801E-2,7.042074648634801E-2,0]
["5218","HKD",22.259961000000001,22.259961000000001,2.478197004983456E-2,2.478197004983456E-2,0]
["5218","JPY",71.481938,71.481938,7.9580698574455308E-2,7.9580698574455308E-2,0]
["5218","USD",53.915564000000003,53.915564000000003,6.0024089542112781E-2,6.0024089542112781E-2,0]
["5253","CAD",27.7471,27.7471,1,1]
["5256","AUD",0.48825001000000001,0.14724141000000016,1.967908917962484E-2,5.9346170588377607E-3,0.6984302980352215]
["5256","CAD",3.7658999999999998,11.504300000000001,0.15178593020725012,0.46368487662531338]
["5256","CHF",0.26297535999999999,0.25629946999999997,1.059931480899293E-2,1.0330240703570246E-2,2.5385990535387148E-2]
["5256","DKK",3.9309999999999996E-3,3.9309999999999996E-3,1.5844034404649624E-4,1.5844034404649624E-4,0]
["5256","EUR",2.7373356800000002,2.5691257300000001,0.11032928183921389,0.10354952036629506,6.1450245663695946E-2]
["5256","GBP",0.76420420999999994,0.82561053999999989,3.0801520720982158E-2,3.3276524549990728E-2,-8.0353299807128797E-2]
["5256","HKD",0.48821782000000002,0.48821782000000002,1.9677791750300277E-2,1.9677791750300277E-2,0]
["5256","IDR",0.10677122,0.10677122,4.3034517504614966E-3,4.3034517504614966E-3,0]
["5256","JPY",1.4282868400000002,1.2773077399999999,5.756760578139989E-2,5.1482339806373081E-2,0.10570642798893271]
["5256","KOR",0.12465091,0.12465091,5.0240989738257035E-3,5.0240989738257035E-3,0]
["5256","NOK",0.144791,-6.2754900000000198E-3,5.8358524179181479E-3,-2.5293584193852706E-4,1.0433417132280323]
["5256","NZD",0.132463,-4.1593690000000003E-2,5.3389680217326464E-3,-1.676448372872885E-3,1.3140023251775967]
["5256","SEK",0.28862988000000001,0.28317422999999997,1.1633329302797998E-2,1.14134374017557E-2,1.8901889159916641E-2]
["5256","USD",14.07420486,7.2717939499999984,0.56726580010156946,0.29309222469428381,0.48332470485298884]
["5279","AUD",0.226105,0.226105,1.9905361387446079E-2,1.9905361387446079E-2,0]
["5279","CAD",0.70589999999999997,0.70589999999999997,6.2144554978431195E-2,6.2144554978431195E-2]
["5279","CHF",2.5357999999999999E-2,2.5357999999999999E-2,2.2324148252487012E-3,2.2324148252487012E-3,0]
["5279","DKK",2.9951999999999999E-2,2.9951999999999999E-2,2.6368518355489039E-3,2.6368518355489039E-3,0]
["5279","EUR",0.90896299999999997,0.90896299999999997,8.0021392728233109E-2,8.0021392728233109E-2,0]
["5279","GBP",0.14874599999999999,0.14874599999999999,1.3094990756228541E-2,1.3094990756228541E-2,0]
["5279","HKD",4.6766000000000002E-2,4.6766000000000002E-2,4.1170877718108992E-3,4.1170877718108992E-3,0]
["5279","ILS",8.6870000000000003E-3,8.6870000000000003E-3,7.6476802535434458E-4,7.6476802535434458E-4,0]
["5279","NOK",3.8545000000000003E-2,3.8545000000000003E-2,3.3933444845496963E-3,3.3933444845496963E-3,0]
["5279","NZD",9.2800000000000001E-3,9.2800000000000001E-3,8.1697332511664761E-4,8.1697332511664761E-4,0]
["5279","SEK",0.223854,0.223854,1.9707192534554097E-2,1.9707192534554097E-2,0]
["5279","SGD",7.4019999999999997E-3,7.4019999999999997E-3,6.5164186988291223E-4,6.5164186988291223E-4,0]
["5279","USD",8.9794710000000002,8.9794710000000002,0.79051597851923583,0.79051597851923583,0]
["5299","CAD",0.48370000000000002,0.48370000000000002,1.4599090914578568E-2,1.4599090914578568E-2]
["5299","CNY",21.840097,21.840097,0.65918040456112181,0.65918040456112181,0]
["5299","HKD",8.0932189999999995,8.0932189999999995,0.24427049818605465,0.24427049818605465,0]
["5299","USD",2.7151640000000001,2.7151640000000001,8.1949402695866869E-2,8.1949402695866869E-2,0]
["5401","CAD",15.436274632961155,25.186740821160129,0.41476519089341546,0.67675547456021667]
["5401","CHF",0.22290286496980841,0.25693156496980846,5.9892915575936847E-3,6.9036261743941185E-3,-0.15266156406113995]
["5401","EUR",1.3019308997109744,0.7301541464467971,3.4982249991562284E-2,1.9618886754318526E-2,0.43917596040704654]
["5401","GBP",0.67930202632862391,0.61021965245971732,1.8252515022170679E-2,1.6396305239278857E-2,0.10169611040654669]
["5401","JPY",0.31273055169347008,0.52184181169346999,8.4029178059824988E-3,1.402163564653343E-2,-0.66866271577125924]
["5401","USD",17.748237351872636,8.4190971381366282,0.47688650456842552,0.22621704489456748,0.52563756212960944]
["5401","NZD",1.2498895045045271E-2,1.2498895045045271E-2,3.3583923016278282E-4,3.3583923016278282E-4,0]
["5401","DKK",0.17339651176314011,0.17339651176314011,4.6590799277516429E-3,4.6590799277516429E-3,0]
["5401","NOK",4.5126239857515682E-2,4.5126239857515682E-2,1.2125201147198095E-3,1.2125201147198095E-3,0]
["5401","SEK",0.14000347804778809,0.14000347804778809,3.7618253548196679E-3,3.7618253548196679E-3,0]
["5401","BRL",9.447226188776485E-2,9.447226188776485E-2,2.5384237238395687E-3,2.5384237238395687E-3,0]
["5401","COP",1.8409692238245462E-3,1.8409692238245462E-3,4.9465947562116839E-5,4.9465947562116839E-5,0]
["5401","HKD",0.19764752110951245,0.19764752110951245,5.3106927527416968E-3,5.3106927527416968E-3,0]
["5401","HUF",5.3645922552064398E-3,5.3645922552064398E-3,1.4414398445884637E-4,1.4414398445884637E-4,0]
["5401","IDR",1.5593062695153696E-2,1.5593062695153696E-2,4.1897800985986734E-4,4.1897800985986734E-4,0]
["5401","INR",0.19642785822475953,0.19642785822475953,5.2779210042953476E-3,5.2779210042953476E-3,0]
["5401","KOR",9.0576386568361728E-2,9.0576386568361728E-2,2.4337434490342216E-3,2.4337434490342216E-3,0]
["5401","MXN",5.7703166342783621E-2,3.4118172839580206E-2,1.5504560117254155E-3,9.1673870847868051E-4,0.40872962435193927]
["5401","MYR",2.9513173858671339E-2,2.9513173858671339E-2,7.9300462581975771E-4,7.9300462581975771E-4,0]
["5401","NTD",0.114731847600741,0.114731847600741,3.0827889373037784E-3,3.0827889373037784E-3,0]
["5401","PHP",2.1938802734570145E-2,2.1938802734570145E-2,5.8948495803170457E-4,5.8948495803170457E-4,0]
["5401","PLN",5.407889858894694E-3,5.407889858894694E-3,1.4530737000918115E-4,1.4530737000918115E-4,0]
["5401","THB",7.0775858595833921E-2,7.0775858595833921E-2,1.9017128937615416E-3,1.9017128937615416E-3,0]
["5401","TRL",1.4528603971862118E-2,1.4528603971862118E-2,3.903765217377621E-4,3.903765217377621E-4,0]
["5401","ZAR",3.0102502729694437E-2,3.0102502729694437E-2,8.0883960592350343E-4,8.0883960592350343E-4,0]
["5401","AUD",0.14282518513419862,0.14282518513419862,3.8376432517001312E-3,3.8376432517001312E-3,0]
["5401","ILS",7.5483757987436107E-3,7.5483757987436107E-3,2.0282118604030992E-4,2.0282118604030992E-4,0]
["5401","SGD",1.4185777517241725E-2,1.4185777517241725E-2,3.8116494165934628E-4,3.8116494165934628E-4,0]
["5401","RUB",3.3304195390094209E-2,3.3304195390094209E-2,8.9486753034492958E-4,8.9486753034492958E-4,0]
["5421","CAD",7.09726981982854,11.038299140750611,0.56373621451095257,0.87677221385343662]
["5421","EUR",0.1875604059872045,-1.0683006429019776E-2,1.4897924969395975E-2,-8.4855131012015982E-4,1.0569576845005795]
["5421","GBP",0.11289432659141703,4.5797117768192265E-2,8.967197517924734E-3,3.6376655335863656E-3,0.59433641042087526]
["5421","JPY",6.5227685845610228E-2,5.8847805845610224E-2,5.1810357550704329E-3,4.6742818212991751E-3,9.7809387490777611E-2]
["5421","USD",4.8601846062162997,1.2031869029745901,0.38604451307150289,9.5569148031691781E-2,0.75244008191876421]
["5421","NZD",3.3700018839019998E-3,3.3700018839019998E-3,2.6767928416896353E-4,2.6767928416896353E-4,0]
["5421","CHF",3.2866535190158148E-2,3.2866535190158148E-2,2.610589226920272E-3,2.610589226920272E-3,0]
["5421","DKK",2.4391902185748989E-2,2.4391902185748989E-2,1.9374490405449684E-3,1.9374490405449684E-3,0]
["5421","NOK",5.4288081925762807E-3,5.4288081925762807E-3,4.3121029036246141E-4,4.3121029036246141E-4,0]
["5421","SEK",1.6062845071721246E-2,1.6062845071721246E-2,1.2758719486343001E-3,1.2758719486343001E-3,0]
["5421","BRL",1.3261750919044578E-2,1.3261750919044578E-2,1.0533810113858612E-3,1.0533810113858612E-3,0]
["5421","COP",2.4151205668241949E-4,2.4151205668241949E-4,1.9183305136930943E-5,1.9183305136930943E-5,0]
["5421","HKD",3.2377907970721341E-2,3.2377907970721341E-2,2.5717775618737016E-3,2.5717775618737016E-3,0]
["5421","HUF",7.037671744049563E-4,7.037671744049563E-4,5.5900233874115851E-5,5.5900233874115851E-5,0]
["5421","IDR",2.0456141214902739E-3,2.0456141214902739E-3,1.6248315063029889E-4,1.6248315063029889E-4,0]
["5421","INR",2.5768869688668754E-2,2.5768869688668754E-2,2.0468215834109436E-3,2.0468215834109436E-3,0]
["5421","KOR",1.1534933941598531E-2,1.1534933941598531E-2,9.1621992117354111E-4,9.1621992117354111E-4,0]
["5421","MXN",1.6950108065160081E-2,4.6613360440086737E-3,1.3463472572944615E-3,3.7024996973785502E-4,0.72499667694805048]
["5421","MYR",3.871757998770787E-3,3.871757998770787E-3,3.0753377751422089E-4,3.0753377751422089E-4,0]
["5421","NTD",1.4629835638158584E-2,1.4629835638158584E-2,1.1620479946431277E-3,1.1620479946431277E-3,0]
["5421","PHP",2.8780955710756072E-3,2.8780955710756072E-3,2.286071607008592E-4,2.286071607008592E-4,0]
["5421","PLN",7.0944727659289332E-4,7.0944727659289332E-4,5.635140444910469E-5,5.635140444910469E-5,0]
["5421","THB",9.2849043600160813E-3,9.2849043600160813E-3,7.3750004845358358E-4,7.3750004845358358E-4,0]
["5421","TRL",1.9059704967143974E-3,1.9059704967143974E-3,1.5139125608349663E-4,1.5139125608349663E-4,0]
["5421","ZAR",4.5464541820550378E-3,4.5464541820550378E-3,3.6112490226574405E-4,3.6112490226574405E-4,0]
["5421","AUD",2.2302723600811057E-2,2.2302723600811057E-2,1.77150556413664E-3,1.77150556413664E-3,0]
["5421","ILS",1.5217175480257068E-3,1.5217175480257068E-3,1.2087004043191711E-4,1.2087004043191711E-4,0]
["5421","SGD",2.6223650211470162E-3,2.6223650211470162E-3,2.0829448049969549E-4,2.0829448049969549E-4,0]
["5421","RUB",1.7352884343222776E-2,1.7352884343222776E-2,1.3783397811880167E-3,1.3783397811880167E-3,0]
["5441","CAD",14.418040441851325,23.943760697303961,0.48888965738660506,0.8118895914505232]
["5441","CHF",0.11870376241832653,0.18030513241832652,4.0250297516674872E-3,6.1138207212382773E-3,-0.51895044221858155]
["5441","EUR",0.7089971392545702,0.34401799240380748,2.4040809837938184E-2,1.1665027513234621E-2,0.51478225601092942]
["5441","GBP",0.37726400204163152,0.3106472219453999,1.2792339530901602E-2,1.0533485081935747E-2,0.176578681601539]
["5441","JPY",0.2454188274215241,0.29271509742152413,8.3217082750064123E-3,9.9254391931723873E-3,-0.19271655111759367]
["5441","USD",12.6013699090798,3.4243031446136807,0.42728964745925252,0.11611192227611035,0.72825945358953947]
["5441","NZD",1.1363242292650589E-2,1.1363242292650589E-2,3.8530698076898992E-4,3.8530698076898992E-4,0]
["5441","DKK",8.2358132289344424E-2,8.2358132289344424E-2,2.7926152128872968E-3,2.7926152128872968E-3,0]
["5441","NOK",2.1886113353804162E-2,2.1886113353804162E-2,7.4211849399500067E-4,7.4211849399500067E-4,0]
["5441","SEK",7.6035564104416004E-2,7.6035564104416004E-2,2.5782283684198108E-3,2.5782283684198108E-3,0]
["5441","BRL",6.6424206761640431E-2,6.6424206761640431E-2,2.2523246357121205E-3,2.2523246357121205E-3,0]
["5441","COP",1.2767771408942754E-3,1.2767771408942754E-3,4.329320211635512E-5,4.329320211635512E-5,0]
["5441","HKD",0.14591097182066817,0.14591097182066817,4.947576982464996E-3,4.947576982464996E-3,0]
["5441","HUF",3.7205340931429028E-3,3.7205340931429028E-3,1.261565776173021E-4,1.261565776173021E-4,0]
["5441","IDR",1.0814339396909407E-2,1.0814339396909407E-2,3.6669467698750846E-4,3.6669467698750846E-4,0]
["5441","INR",0.13622965336442616,0.13622965336442616,4.6193009950163833E-3,4.6193009950163833E-3,0]
["5441","KOR",6.0980557992285842E-2,6.0980557992285842E-2,2.0677403579445479E-3,2.0677403579445479E-3,0]
["5441","MXN",4.9790292421982109E-2,2.3855346493714163E-2,1.6882987047743448E-3,8.0889162582021071E-4,0.52088358325884876]
["5441","MYR",2.0468427853295459E-2,2.0468427853295459E-2,6.9404734442228783E-4,6.9404734442228783E-4,0]
["5441","NTD",7.7342058920079615E-2,7.7342058920079615E-2,2.6225292431040783E-3,2.6225292431040783E-3,0]
["5441","PHP",1.5215334111830632E-2,1.5215334111830632E-2,5.1592444278096778E-4,5.1592444278096778E-4,0]
["5441","PLN",3.7505625096581003E-3,3.7505625096581003E-3,1.2717478687543148E-4,1.2717478687543148E-4,0]
["5441","THB",4.9085556245528315E-2,4.9085556245528315E-2,1.6644023764734233E-3,1.6644023764734233E-3,0]
["5441","TRL",1.0076099698094258E-2,1.0076099698094258E-2,3.4166230487851567E-4,3.4166230487851567E-4,0]
["5441","ZAR",2.1499428712962704E-2,2.1499428712962704E-2,7.2900671765201727E-4,7.2900671765201727E-4,0]
["5441","AUD",0.10342527677422708,0.10342527677422708,3.5069639547199213E-3,3.5069639547199213E-3,0]
["5441","ILS",6.1697417748374254E-3,6.1697417748374254E-3,2.092047774889434E-4,2.092047774889434E-4,0]
["5441","SGD",1.0997830401733006E-2,1.0997830401733006E-2,3.7291652487616748E-4,3.7291652487616748E-4,0]
["5441","RUB",3.6622545878982206E-2,3.6622545878982206E-2,1.2418042506962099E-3,1.2418042506962099E-3,0]
["5461","CAD",36.094430155411274,45.132973893401818,0.6992307305165667,0.87432776109743504]
["5461","CHF",0.43717329809079469,0.60086076809079469,8.4690353406378649E-3,1.1640031772267342E-2,-0.37442238744875134]
["5461","EUR",2.9635248060649246,1.3493788569636251,5.7410176753769353E-2,2.6140519737692321E-2,0.54467097619628868]
["5461","GBP",1.4732183995799946,1.1233960268916388,2.8539571709911907E-2,2.1762721316299409E-2,0.23745452323164573]
["5461","JPY",0.58010426900268675,0.76226762900268685,1.1237931449368401E-2,1.4766847648840703E-2,-0.31401830624893479]
["5461","USD",6.1222142608654728,-1.2751582404078758,0.11860113406893955,-2.4702698563893125E-2,1.2082838309921566]
["5461","NZD",2.9258426716825353E-2,2.9258426716825353E-2,5.6680188602185487E-4,5.6680188602185487E-4,0]
["5461","DKK",0.40908457361159972,0.40908457361159972,7.9248932319440791E-3,7.9248932319440791E-3,0]
["5461","NOK",0.10510908736258487,0.10510908736258487,2.0362006997761508E-3,2.0362006997761508E-3,0]
["5461","SEK",0.38117160048159732,0.38117160048159732,7.3841558243012877E-3,7.3841558243012877E-3,0]
["5461","BRL",0.25363274841051892,0.25363274841051892,4.9134398628931878E-3,4.9134398628931878E-3,0]
["5461","COP",5.0184711489596363E-3,5.0184711489596363E-3,9.7219134156001648E-5,9.7219134156001648E-5,0]
["5461","HKD",0.53246577534910722,0.53246577534910722,1.031506610491837E-2,1.031506610491837E-2,0]
["5461","HUF",1.4623846564233297E-2,1.4623846564233297E-2,2.8329697607202794E-4,2.8329697607202794E-4,0]
["5461","IDR",4.250659611624532E-2,4.250659611624532E-2,8.2344888466618336E-4,8.2344888466618336E-4,0]
["5461","INR",0.53546117262351278,0.53546117262351278,1.0373093723455407E-2,1.0373093723455407E-2,0]
["5461","KOR",0.26631379264759297,0.26631379264759297,5.15910036473305E-3,5.15910036473305E-3,0]
["5461","MXN",0.11518186427015777,9.2173228164711712E-2,2.2313331655080329E-3,1.7856038559461551E-3,0.19975919170295386]
["5461","MYR",8.0452736312602038E-2,8.0452736312602038E-2,1.5585514258488352E-3,1.5585514258488352E-3,0]
["5461","NTD",0.33629224311482686,0.33629224311482686,6.5147411888142022E-3,6.5147411888142022E-3,0]
["5461","PHP",5.980504570164942E-2,5.980504570164942E-2,1.1585589691951875E-3,1.1585589691951875E-3,0]
["5461","PLN",1.4741875574233359E-2,1.4741875574233359E-2,2.8558346488842274E-4,2.8558346488842274E-4,0]
["5461","THB",0.19293456936132383,0.19293456936132383,3.737578881161325E-3,3.737578881161325E-3,0]
["5461","TRL",3.9604887970902468E-2,3.9604887970902468E-2,7.6723623641331235E-4,7.6723623641331235E-4,0]
["5461","ZAR",7.9377014382759362E-2,7.9377014382759362E-2,1.5377122595952623E-3,1.5377122595952623E-3,0]
["5461","AUD",0.39175940647946528,0.39175940647946528,7.5892655681199465E-3,7.5892655681199465E-3,0]
["5461","ILS",1.390719950343265E-2,1.390719950343265E-2,2.6941390198861393E-4,2.6941390198861393E-4,0]
["5461","SGD",1.8341697346198015E-2,1.8341697346198015E-2,3.5532015269599913E-4,3.5532015269599913E-4,0]
["5461","RUB",3.2490325359270163E-2,3.2490325359270163E-2,6.2941107084571858E-4,6.2941107084571858E-4,0]
["5481","CAD",43.092399999999998,46.476300000000002,1,1.0785266079401472]
["5481","CHF",0,7.1957929999999989E-2,0,1.6698519924627077E-3]
["5481","EUR",0,-1.02808955,0,-2.3857792789447791E-2]
["5481","GBP",0,-0.21860728000000001,0,-5.0729892045929216E-3]
["5481","JPY",0,0.12978676,0,3.0118248229386154E-3]
["5481","USD",0,-2.3389071799999996,0,-5.4276558743537137E-2]
["5501","AED",2.7322350000000002,2.7322350000000002,1.2287489021137431E-2,1.2287489021137431E-2,0]
["5501","BRL",14.734095119999999,14.734095119999999,6.6262613583163446E-2,6.6262613583163446E-2,0]
["5501","CAD",0.84309999999999996,0.84309999999999996,3.7916145550148384E-3,3.7916145550148384E-3]
["5501","CNY",7.7425011799999996,7.7425011799999996,3.4819808049232071E-2,3.4819808049232071E-2,0]
["5501","EGP",7.2533E-2,7.2533E-2,3.2619757860146044E-4,3.2619757860146044E-4,0]
["5501","HKD",51.542064060000001,51.542064060000001,0.23179651320768974,0.23179651320768974,0]
["5501","IDR",0.759822,0.759822,3.4170942408023779E-3,3.4170942408023779E-3,0]
["5501","INR",13.68885715,13.68885715,6.1561938099227782E-2,6.1561938099227782E-2,0]
["5501","KOR",31.53484847,31.53484847,0.14181946441589302,0.14181946441589302,0]
["5501","MXN",5.3292881100000002,5.3292881100000002,2.396703400040745E-2,2.396703400040745E-2,0]
["5501","MYR",2.9127559999999999,2.9127559999999999,1.3099333465551893E-2,1.3099333465551893E-2,0]
["5501","NGN",0.69256700000000004,0.69256700000000004,3.114633041777917E-3,3.114633041777917E-3,0]
["5501","NTD",34.750445339999999,34.750445339999999,0.15628074290640678,0.15628074290640678,0]
["5501","PKR",7.6825000000000004E-2,7.6825000000000004E-2,3.4549968946627328E-4,3.4549968946627328E-4,0]
["5501","PHP",4.1501766499999997,4.1501766499999997,1.866429865024638E-2,1.866429865024638E-2,0]
["5501","RUB",9.4422462300000003,9.4422462300000003,4.2463952363541675E-2,4.2463952363541675E-2,0]
["5501","THB",6.9315129999999998,6.9315129999999998,3.1172607732267311E-2,3.1172607732267311E-2,0]
["5501","TRL",2.074951,2.074951,9.3315317430228851E-3,9.3315317430228851E-3,0]
["5501","USD",23.871953899999998,23.871953899999998,0.10735766559587621,0.10735766559587621,0]
["5501","ZAR",8.4762833999999998,8.4762833999999998,3.8119795412015968E-2,3.8119795412015968E-2,0]
["5515","AED",0.26371800000000001,0.26371800000000001,3.9147221805755751E-3,3.9147221805755751E-3,0]
["5515","BRL",4.3391755400000003,4.3391755400000003,6.4412238572448599E-2,6.4412238572448599E-2,0]
["5515","CAD",0.627,0.627,9.3074071819932106E-3,9.3074071819932106E-3]
["5515","CNY",2.4312279999999999,2.4312279999999999,3.6089998322588496E-2,3.6089998322588496E-2,0]
["5515","COP",0.36063659000000003,0.36063659000000003,5.3534156106148983E-3,5.3534156106148983E-3,0]
["5515","EUR",5.6661000000000003E-2,5.6661000000000003E-2,8.410956911306496E-4,8.410956911306496E-4,0]
["5515","HKD",16.610545819999999,16.610545819999999,0.24657274874305468,0.24657274874305468,0]
["5515","IDR",0.66691100000000003,0.66691100000000003,9.8998600177835315E-3,9.8998600177835315E-3,0]
["5515","INR",4.1162065999999999,4.1162065999999999,6.1102409683266114E-2,6.1102409683266114E-2,0]
["5515","KOR",9.35669532,9.35669532,0.13889405617398765,0.13889405617398765,0]
["5515","MXN",1.2375579999999999,1.2375579999999999,1.8370743568314439E-2,1.8370743568314439E-2,0]
["5515","MYR",0.78451300000000002,0.78451300000000002,1.1645585216215374E-2,1.1645585216215374E-2,0]
["5515","NTD",9.7457791,9.7457791,0.1446697518173195,0.1446697518173195,0]
["5515","PKR",0.123998,0.123998,1.8406696582979171E-3,1.8406696582979171E-3,0]
["5515","PHP",1.4526870000000001,1.4526870000000001,2.1564193647509045E-2,2.1564193647509045E-2,0]
["5515","PLN",0.500305,0.500305,7.426702312898107E-3,7.426702312898107E-3,0]
["5515","RUB",3.1961242000000003,3.1961242000000003,4.7444384902108942E-2,4.7444384902108942E-2,0]
["5515","THB",1.811512,1.811512,2.6890717382881794E-2,2.6890717382881794E-2,0]
["5515","TRL",0.53608199999999995,0.53608199999999995,7.9577886075554768E-3,7.9577886075554768E-3,0]
["5515","USD",6.8371409999999999,6.8371409999999999,0.10149291108086163,0.10149291108086163,0]
["5515","ZAR",2.3112719199999998,2.3112719199999998,3.4309328337714891E-2,3.4309328337714891E-2,0]
["5517","AED",0.28791099999999997,0.28791099999999997,2.928835773767016E-3,2.928835773767016E-3,0]
["5517","BRL",9.2821987899999989,9.2821987899999989,9.4425137891115341E-2,9.4425137891115341E-2,0]
["5517","CAD",0.5534,0.5534,5.6295789921283548E-3,5.6295789921283548E-3]
["5517","CLP",0.18489606,0.18489606,1.8808944255571086E-3,1.8808944255571086E-3,0]
["5517","CNY",2.9147159999999999,2.9147159999999999,2.9650567332165506E-2,2.9650567332165506E-2,0]
["5517","EGP",0.53537599999999996,0.53537599999999996,5.4462260254602643E-3,5.4462260254602643E-3,0]
["5517","EUR",0.36180200000000001,0.36180200000000001,3.6805076590350982E-3,3.6805076590350982E-3,0]
["5517","HKD",8.9641956199999999,8.9641956199999999,9.1190183129166991E-2,9.1190183129166991E-2,0]
["5517","IDR",1.121875,1.121875,1.1412511622323812E-2,1.1412511622323812E-2,0]
["5517","INR",11.470058799999999,11.470058799999999,0.11668160834650698,0.11668160834650698,0]
["5517","KOR",16.85605241,16.85605241,0.17147177184233925,0.17147177184233925,0]
["5517","MAD",8.5392999999999997E-2,8.5392999999999997E-2,8.6867842225301164E-4,8.6867842225301164E-4,0]
["5517","MXN",1.9149882899999999,1.9149882899999999,1.9480624950408025E-2,1.9480624950408025E-2,0]
["5517","MYR",0.62619381000000007,0.62619381000000007,6.3700894791774761E-3,6.3700894791774761E-3,0]
["5517","NGN",0.27123599999999998,0.27123599999999998,2.7592057960045655E-3,2.7592057960045655E-3,0]
["5517","NTD",22.940832099999998,22.940832099999998,0.23337048509595917,0.23337048509595917,0]
["5517","PHP",1.5394701399999999,1.5394701399999999,1.5660586843427714E-2,1.5660586843427714E-2,0]
["5517","PKR",1.1303840000000001,1.1303840000000001,1.1499071231366134E-2,1.1499071231366134E-2,0]
["5517","PLN",0.92588360999999997,0.92588360999999997,9.4187475966967162E-3,9.4187475966967162E-3,0]
["5517","RUB",0.68299100000000001,0.68299100000000001,6.9478709530407254E-3,6.9478709530407254E-3,0]
["5517","THB",5.2486820999999999,5.2486820999999999,5.3393333007806541E-2,5.3393333007806541E-2,0]
["5517","TRL",1.6137031499999999,1.6137031499999999,1.6415737898032801E-2,1.6415737898032801E-2,0]
["5517","USD",4.3728684699999993,4.3728684699999993,4.4483932912996856E-2,4.4483932912996856E-2,0]
["5517","ZAR",4.4171440000000004,4.4171440000000004,4.4934335142041586E-2,4.4934335142041586E-2,0]
["5519","CAD",7.0000000000000001E-3,7.0000000000000001E-3,4.5507736315173581E-4,4.5507736315173581E-4]
["5519","USD",15.374954000000001,15.374954000000001,0.99954193212846187,0.99954193212846187,0]
["5546","AUD",-0.48749191000000003,10.534137469999999,-1.9530299910259289E-3,4.2202723750841317E-2,22.608845713972972]
["5546","BRL",0,5.3612817800000032,0,2.1478805887631819E-2]
["5546","CAD",168.00720000000001,252.25919999999999,0.67308419601935843,1.0106214544405627]
["5546","CHF",0.10899709999999997,-0.11385651000000351,4.3667310342617214E-4,-4.5614126951060667E-4,2.0445829292706277]
["5546","COP",0,0.22172147999999997,0,8.8827874106599139E-4]
["5546","DKK",0.18079700000000001,0.18079700000000001,7.2432373962373002E-4,7.2432373962373002E-4,0]
["5546","EUR",0.91645416000000002,-10.73911348,3.6715736675106566E-3,-4.3023915419377584E-2,12.718113080527672]
["5546","GBP",-1.6921330000000001,-5.0557519499999994,-6.7791617255857188E-3,-2.0254767275087335E-2,-1.9877982108971333]
["5546","HKD",1.5363990000000001,-2.0605081300000001,6.1552474279670524E-3,-8.2549763228742679E-3,2.3411282681126453]
["5546","IDR",0,3.1582168299999993,0,1.2652706764206273E-2]
["5546","ILS",1.1900000000000001E-4,-6.639463469999999,4.7674754014294417E-7,-2.6599561993205342E-2,55794.810672268897]
["5546","INR",0,9.1176410699999959,0,3.6527839933014949E-2]
["5546","JPY",46.424766409999997,-8.4507919900000026,0.18599069905611998,-3.385625456716132E-2,1.182031976539567]
["5546","KOR",0,-9.6012601700000015,0,-3.846535435562963E-2]
["5546","MXN",1.0011829999999999,6.2328950599999997,4.0110212813691867E-3,2.4970734351463093E-2,-5.2255302577051346]
["5546","MYR",0.10835500000000001,0.10835500000000001,4.3410066985032536E-4,4.3410066985032536E-4,0]
["5546","NOK",-8.9542999999999998E-2,0.11972416000000015,-3.5873449568924072E-4,4.7964872920739781E-4,2.3370577264554475]
["5546","NTD",0,1.3291600100000001,0,5.3249896237300091E-3]
["5546","NZD",0.15301799999999999,-2.6403124299999998,6.1303323611422704E-4,-1.0577835766481842E-2,18.254913997046099]
["5546","PEN",0,0.74311034000000009,0,2.9771094676452683E-3]
["5546","PHP",0,0.45057013000000007,0,1.8051109339444252E-3]
["5546","PLN",0,-3.2790216599999997,0,-1.3136684962020447E-2]
["5546","SEK",0.63162099999999999,6.0931982099999988,2.5304517483413992E-3,2.44110693968142E-2,-8.6469215083095694]
["5546","SGD",-0.25548008999999999,-4.9125894699999995,-1.0235252475882183E-3,-1.9681218029870835E-2,-18.228854467680826]
["5546","THB",0,0.87508372999999984,0,3.5058320646774136E-3]
["5546","TRL",0,4.0685271099999989,0,1.6299666316784714E-2]
["5546","USD",31.514882,-4.2682308599999841,0.12625749975962308,-1.7099735825774752E-2,1.135435406675487]
["5546","ZAR",1.5488120000000001,6.5152587300000002,6.2049774045703663E-3,2.6101962797666741E-2,-3.2066168973380886]
["5782","AUD",0.108404,0.108404,5.8600874656056911E-3,5.8600874656056911E-3,0]
["5782","CAD",3.0527000000000002,3.0527000000000002,0.16502240697994996,0.16502240697994996]
["5782","EUR",5.5502733300000004,5.5502733300000004,0.30003585819544076,0.30003585819544076,0]
["5782","GBP",0.27839199999999997,0.27839199999999997,1.5049273732748785E-2,1.5049273732748785E-2,0]
["5782","JPY",1.317672,1.317672,7.1230518901328199E-2,7.1230518901328199E-2,0]
["5782","NOK",0.307838,0.307838,1.6641061263764481E-2,1.6641061263764481E-2,0]
["5782","USD",7.88338713,7.88338713,0.42615898036078209,0.42615898036078209,0]
["5937","CAD",45.782200000000003,66.706599999999995,0.37645253702674347,0.54850725405131606]
["5937","CHF",1.9703887499999999,1.9703887499999999,1.6201882912277123E-2,1.6201882912277123E-2,0]
["5937","EUR",17.685290070000001,8.9178810199999994,0.14542054149659417,7.3328912434999685E-2,0.49574584387916687]
["5937","GBP",3.6030787799999997,3.50095942,2.9626976157507142E-2,2.8787280988827019E-2,2.8342250124211765E-2]
["5937","HKD",3.8005330000000002,3.8005330000000002,3.1250579699181352E-2,3.1250579699181352E-2,0]
["5937","SEK",1.38005278,1.38005278,1.1347737117521881E-2,1.1347737117521881E-2,0]
["5937","USD",47.393267299999998,35.338362759999995,0.38969983340843384,0.29057616967671696,0.2543590097659294]
["5960","AUD",-5.0299999999999997E-4,0.18378119000000001,-1.0552351621978262E-5,3.8555143904286187E-3,366.3701590457257]
["5960","BRL",0,2.2935019999999997E-2,0,4.8114989164434164E-4]
["5960","CAD",46.383800000000001,47.8018,0.9730778671242849,1.0028258484363428]
["5960","CHF",5.6842999999999998E-2,2.6133919999999998E-2,1.1924996486045931E-3,5.4825907177067615E-4,0.5402438294952765]
["5960","COP",0,3.111881E-2,0,6.5283623295732277E-4]
["5960","EUR",-7.9629999999999996E-3,-0.15338801000000002,-1.6705442537934969E-4,-3.2179010260745887E-3,-18.262590732136132]
["5960","GBP",2.1979999999999999E-3,0.31775829999999999,4.6111468916716138E-5,6.6661974401631312E-3,-143.56701546860782]
["5960","IDR",0,6.608646E-2,0,1.3864166269817128E-3]
["5960","INR",0,2.02975E-2,0,4.2581780725070329E-4]
["5960","JPY",0,-0.35366702,0,-7.4195203819825417E-3]
["5960","KOR",0,9.007214999999999E-2,0,1.8896083462178314E-3]
["5960","MXN",0,-2.8586759999999996E-2,0,-5.9971678579145776E-4]
["5960","NOK",0,-3.7223249999999999E-2,0,-7.8090024356421931E-4]
["5960","NTD",0,0.19211533999999997,0,4.0303551086598504E-3]
["5960","NZD",0,-0.21780720000000001,0,-4.5693402787247393E-3]
["5960","PEN",0,0.10615862000000001,0,2.2270836698687355E-3]
["5960","PHP",0,6.4737079999999989E-2,0,1.3581082130022591E-3]
["5960","SEK",0,-2.45504E-2,0,-5.1503867447358874E-4]
["5960","THB",0,0.12663388,0,2.6566306739868799E-3]
["5960","USD",1.232742,-0.55515395000000067,2.5861485175309597E-2,-1.1646480486541046E-2,1.4503407444542336]
["5960","ZAR",0,-1.2139440000000003E-2,0,-2.5467125124037338E-4]
["5968","AUD",1.0232319999999999,1.0232319999999999,4.1757242606399687E-2,4.1757242606399687E-2,0]
["5968","CAD",1.2784,1.2784,5.2170435392971844E-2,5.2170435392971844E-2]
["5968","CHF",8.7438000000000002E-2,8.7438000000000002E-2,3.5682716910909514E-3,3.5682716910909514E-3,0]
["5968","DKK",0.59997400000000001,0.59997400000000001,2.4484437425268218E-2,2.4484437425268218E-2,0]
["5968","EUR",3.8352539999999999,3.8352539999999999,0.15651350987377724,0.15651350987377724,0]
["5968","GBP",1.8247549999999999,1.8247549999999999,7.4466726248046261E-2,7.4466726248046261E-2,0]
["5968","HKD",0.25751499999999999,0.25751499999999999,1.0508971894728681E-2,1.0508971894728681E-2,0]
["5968","JPY",2.3084479999999998,2.3084479999999998,9.4205833261917296E-2,9.4205833261917296E-2,0]
["5968","SEK",0.95177800000000001,0.95177800000000001,3.8841264594377312E-2,3.8841264594377312E-2,0]
["5968","USD",12.337524,12.337524,0.50348404157637638,0.50348404157637638,0]
["5976","AUD",-8.6858000000000005E-2,34.62960657,-7.5241795414874592E-4,0.29998316480203746,399.69219381058736]
["5976","BRL",0,12.257716780000001,0,0.10618395751850553]
["5976","CAD",109.6049,115.39490000000001,0.94946573283609892,0.99962230971469668]
["5976","CHF",3.9944E-2,3.9923079999998209E-2,3.460197421137662E-4,3.4583852007777485E-4,5.2373322656196208E-4]
["5976","EUR",0.31393399999999999,-20.894792059999993,2.7194913308818116E-3,-0.18100366913984497,67.557913637898395]
["5976","GBP",-7.7684000000000003E-2,-17.012752679999998,-6.7294706705301962E-4,-0.14737503241985991,-217.99944235621231]
["5976","HKD",-2.9045000000000001E-2,-2.9045000000000001E-2,-2.5160583340913127E-4,-2.5160583340913127E-4,0]
["5976","IDR",0,7.1750731200000004,0,6.2154940682701179E-2]
["5976","ILS",0,-22.531681840000001,0,-0.19518342528705762]
["5976","INR",0,24.167492039999996,0,0.20935382944165071]
["5976","JPY",0.11902,-9.9740220900000018,1.0310251779085833E-3,-8.6401175431073701E-2,84.801227440766269]
["5976","KOR",0,-33.881601800000006,0,-0.29350348280686256]
["5976","MXN",7.3039000000000007E-2,15.865776419999998,6.327091914742482E-4,0.13743921152821631,-216.22335218171108]
["5976","NOK",0,1.2490351599999998,0,1.0819918484734294E-2]
["5976","NZD",0,-5.7269407000000001,0,-4.9610318048138188E-2]
["5976","PLN",0,-7.3956701400000018,0,-6.4065889109785751E-2]
["5976","SEK",-5.5034E-2,14.314766239999994,-4.7673869636213223E-4,0.12400339782654828,261.10768325035423]
["5976","SGD",0,-8.1278819200000001,0,-7.0408762414619047E-2]
["5976","TRL",0,11.822734120000002,0,0.1024158674965458]
["5976","USD",5.4732168099999994,-8.0247163000000423,4.7412404093954787E-2,-6.9515077725369287E-2,2.4661791371645014]
["5976","ZAR",6.3056000000000001E-2,12.120543339999999,5.4623024380947433E-4,0.10499567596599055,-191.21871574473482]
["5986","CAD",23.676600000000001,23.676600000000001,0.9228052944202797,0.9228052944202797]
["5986","EUR",0.75398100000000001,0.75398100000000001,2.9386721855853327E-2,2.9386721855853327E-2,0]
["5986","GBP",0.14680099999999999,0.14680099999999999,5.7216297959247304E-3,5.7216297959247304E-3,0]
["5986","USD",1.079828,1.079828,4.2086743682085342E-2,4.2086743682085342E-2,0]
["5985","CAD",59.4756,59.4756,0.98192030139985176,0.98192030139985176]
["5985","USD",1.095075,1.095075,1.8079285859334628E-2,1.8079285859334628E-2,0]
["5988","CAD",17.348199999999999,23.485700000000001,0.41201841094016439,0.55778356220342284]
["5988","USD",24.75716121,18.619744149999999,0.58798066780032965,0.44221748635566932,0.24790471766694133]
["6100","CAD",4.2977999999999996,4.2977999999999996,0.99999999999999989,0.99999999999999989]
["6101","CAD",13.0966,13.0966,1,1]
["6103","CAD",6.6475999999999997,6.6475999999999997,0.90684127958529426,0.90684127958529426]
["6103","USD",0.68287368000000004,0.68287368000000004,9.3155129936566411E-2,9.3155129936566411E-2,0]
["6106","CAD",2.3E-3,2.3E-3,5.3763440860215054E-4,5.3763440860215054E-4]
["6106","EUR",3.2874E-2,3.8484599999999993E-3,7.6844319775596073E-3,8.9959326788218775E-4,0.88293301697390036]
["6106","GBP",3.9853E-2,-4.3509820000000005E-2,9.3158017765310897E-3,-1.0170598410472185E-2,2.0917577095827165]
["6106","USD",4.20296615,4.3215550900000004,0.98246053062178584,1.0101811804581582,-2.8215535354716215E-2]
["6107","CAD",-3.5000000000000001E-3,-3.5000000000000001E-3,-3.4472569683837291E-4,-3.4472569683837291E-4]
["6107","USD",10.1565125,10.1565125,1.0003459568600412,1.0003459568600412,0]
["8003","AUD",7.2300000000000001E-4,0.99636120000000006,4.5212762631120135E-6,6.2307389253745534E-3,-1377.0929460580915]
["8003","EUR",40.046463000000003,39.517236109999999,0.25043032169224555,0.24712080443697915,1.3215321662739754E-2]
["8003","GBP",7.273625,7.3034699000000005,4.5485571312971124E-2,4.5672206220225553E-2,-4.103167265290697E-3]
["8003","JPY",2.047234,2.03492278,1.2802365821902988E-2,1.2725377679778577E-2,6.0135871131486995E-3]
["8003","USD",104.1907125,103.70676751000001,0.65155601004561303,0.64852966288663794,4.6447996984375628E-3]
["8003","CAD",6.3517999999999999,6.3517999999999999,3.9720944077503303E-2,3.9720944077503303E-2]
["8005","AUD",14.238924000000001,14.238924000000001,0.10965536042682571,0.10965536042682571,0]
["8005","CHF",11.79362897,11.79362897,9.0823901823312153E-2,9.0823901823312153E-2,0]
["8005","DKK",3.9773610000000001,3.9773610000000001,3.0630049995533364E-2,3.0630049995533364E-2,0]
["8005","EUR",34.003401619999998,34.003401619999998,0.26186355516605109,0.26186355516605109,0]
["8005","GBP",17.290835999999999,17.290835999999999,0.13315843624568352,0.13315843624568352,0]
["8005","HKD",2.9077276699999999,2.9077276699999999,2.2392698049157653E-2,2.2392698049157653E-2,0]
["8005","ILS",1.434809,1.434809,1.1049605857763786E-2,1.1049605857763786E-2,0]
["8005","JPY",31.917340129999999,31.917340129999999,0.24579858954375611,0.24579858954375611,0]
["8005","KOR",0.39338899999999999,0.39338899999999999,3.0295275529912606E-3,3.0295275529912606E-3,0]
["8005","NZD",0.72401300000000002,0.72401300000000002,5.5756956402539517E-3,5.5756956402539517E-3,0]
["8005","SEK",3.59248236,3.59248236,2.7666061565664188E-2,2.7666061565664188E-2,0]
["8005","SGD",2.611971,2.611971,2.0115046714865276E-2,2.0115046714865276E-2,0]
["8005","USD",3.6374503599999999,3.6374503599999999,2.8012364576177728E-2,2.8012364576177728E-2,0]
["8005","CAD",1.3283,1.3283,1.0229369526444033E-2,1.0229369526444033E-2]
["8006","AUD",2.23964724,2.23964724,9.6823232589608024E-2,9.6823232589608024E-2,0]
["8006","CHF",0.6856455600000001,0.6856455600000001,2.9641462434017978E-2,2.9641462434017978E-2,0]
["8006","DKK",0.14263000000000001,0.14263000000000001,6.1661039370895718E-3,6.1661039370895718E-3,0]
["8006","EUR",5.1442318600000005,5.1442318600000005,0.22239268264213427,0.22239268264213427,0]
["8006","GBP",3.5663661699999998,3.5663661699999998,0.15417923635939182,0.15417923635939182,0]
["8006","HKD",0.64273427999999999,0.64273427999999999,2.7786344909278768E-2,2.7786344909278768E-2,0]
["8006","ILS",0.44775599999999999,0.44775599999999999,1.9357148106677963E-2,1.9357148106677963E-2,0]
["8006","JPY",6.8789091000000004,6.8789091000000004,0.29738532205280294,0.29738532205280294,0]
["8006","KOR",6.5361000000000002E-2,6.5361000000000002E-2,2.825651822422432E-3,2.825651822422432E-3,0]
["8006","NOK",0.39230700000000002,0.39230700000000002,1.6960006571182771E-2,1.6960006571182771E-2,0]
["8006","NZD",0.12809200000000001,0.12809200000000001,5.5376048903433882E-3,5.5376048903433882E-3,0]
["8006","SEK",1.63341143,1.63341143,7.0614770030218793E-2,7.0614770030218793E-2,0]
["8006","SGD",0.82974351000000002,0.82974351000000002,3.5871028001020266E-2,3.5871028001020266E-2,0]
["8006","USD",0.23396684000000001,0.23396684000000001,1.0114729392641139E-2,1.0114729392641139E-2,0]
["8006","CAD",0.10050000000000001,0.10050000000000001,4.3447622917864538E-3,4.3447622917864538E-3]
["8007","CAD",3.5999999999999999E-3,0.69920000000000004,5.1731570627963786E-3,1.0047420606408968]
["8007","CNY",0.69230999999999998,-3.2696999999999535E-3,0.99484121281793358,-4.6985199022847443E-3,1.0047228842570524]
["611","AUD",215.08093331000001,215.08093331000001,4.9164814016748104E-2,4.9164814016748104E-2,0]
["611","CAD",236.06039999999999,236.06039999999999,5.3960457973238479E-2,5.3960457973238479E-2]
["611","EUR",359.09117300000003,359.09117300000003,8.2083755467784569E-2,8.2083755467784569E-2,0]
["611","GBP",314.213774,314.213774,7.1825342778965282E-2,7.1825342778965282E-2,0]
["611","HKD",129.862402,129.862402,2.968492252586542E-2,2.968492252586542E-2,0]
["611","JPY",347.48579541000004,347.48579541000004,7.9430911154597092E-2,7.9430911154597092E-2,0]
["611","KOR",47.850628999999998,47.850628999999998,1.0938055917669913E-2,1.0938055917669913E-2,0]
["611","NTD",53.058442999999997,53.058442999999997,1.2128497128815207E-2,1.2128497128815207E-2,0]
["611","SEK",60.192525000000003,60.192525000000003,1.3759259136922613E-2,1.3759259136922613E-2,0]
["611","USD",2611.7962670000002,2611.7962670000002,0.59702399343606405,0.59702399343606405,0]
["612","AUD",19.739245,19.739245,2.548312311104289E-2,2.548312311104289E-2,0]
["612","CAD",582.19119999999998,646.70929999999998,0.7516016962029598,0.83489377172006174]
["612","EUR",16.912714999999999,2.5313657100000011,2.1834107560191978E-2,3.2679620738788398E-3,0.85032765525818887]
["612","GBP",16.537849000000001,8.459471970000001,2.1350160153482952E-2,1.092107452265406E-2,0.48847809833068379]
["612","JPY",14.659174999999999,7.6478292699999999,1.8924815069235025E-2,9.8732537551282865E-3,0.47829060844147098]
["612","NZD",0.96293600000000001,5.1271999999997207E-4,1.2431385615840522E-3,6.6191522935619868E-7,0.99946754509126257]
["612","SEK",8.8974600000000006,8.8974600000000006,1.14865116956388E-2,1.14865116956388E-2,0]
["612","USD",114.70011887999999,80.615531789999991,0.14807644619995824,0.1040736624560241,0.29716261345517447]
["613","AUD",28.644158000000001,28.644158000000001,3.3171331576573371E-2,3.3171331576573371E-2,0]
["613","CAD",599.81280000000004,599.81280000000004,0.69461246766872631,0.69461246766872631]
["613","EUR",22.738842000000002,22.738842000000002,2.6332687721151125E-2,2.6332687721151125E-2,0]
["613","GBP",22.274225000000001,22.274225000000001,2.5794638581668205E-2,2.5794638581668205E-2,0]
["613","JPY",19.747152,19.747152,2.2868164834344021E-2,2.2868164834344021E-2,0]
["613","SEK",8.9894420000000004,8.9894420000000004,1.0410212137161612E-2,1.0410212137161612E-2,0]
["613","USD",161.314921,161.314921,0.1868105438023257,0.1868105438023257,0]
["618","CAD",315.80930000000001,364.10079999999999,0.86893380724324976,1.0018055021315491]
["618","NZD",4.2014860000000001,-2.7841200000001116E-3,1.1560182762379741E-2,-7.6603696959594717E-6,1.0006626512619583]
["618","USD",43.433782149999999,-0.65347936999999734,0.11950592236065689,-1.7980164514756784E-3,1.0150454171304535]
["650","CAD",1760.4599000000001,2029.3197,0.56157575142014438,0.64734035430128334]
["650","EUR",339.61336599999998,339.61336599999998,0.10833455008192716,0.10833455008192716,0]
["650","HKD",103.17084147,103.17084147,3.2910856318376716E-2,3.2910856318376716E-2,0]
["650","USD",931.61322601999996,662.75345283999991,0.29717882096327569,0.21141422663754975,0.28859591692210274]
["653","AUD",1.4943E-2,1.4943E-2,3.0611279159378999E-5,3.0611279159378999E-5,0]
["653","CAD",265.73079999999999,265.73079999999999,0.54435921167403523,0.54435921167403523]
["653","EUR",2.6054970000000002,2.6054970000000002,5.337455398241619E-3,5.337455398241619E-3,0]
["653","GBP",4.3295070000000004,4.3295070000000004,8.8691526065372076E-3,8.8691526065372076E-3,0]
["653","USD",215.47269613,215.47269613,0.44140365739540072,0.44140365739540072,0]
["6562","CAD",10.284601097328439,10.892401097328438,0.8882345252341316,0.94072746485602343]
["6562","EUR",0.12285210149179195,-0.46661347850820795,1.0610180891791993E-2,-4.0299297719796519E-2,4.7981725411460179]
["6562","GBP",7.333727996683255E-2,-0.14323649003316746,6.3338094921565075E-3,-1.2370688422117117E-2,2.9531197516181056]
["6562","JPY",0.13216991514295862,-9.5596284857041386E-2,1.1414918353783984E-2,-8.2562191659721201E-3,1.7232832430409131]
["6562","USD",0.51768508457515872,0.94362319457515875,4.4710121565906251E-2,8.1496471501563972E-2,-0.82277454516494064]
["6562","AED",3.396806435988027E-3,3.396806435988027E-3,2.9336682321746195E-4,2.9336682321746195E-4,0]
["6562","BRL",2.1350309565090309E-2,2.1350309565090309E-2,1.8439297645754971E-3,1.8439297645754971E-3,0]
["6562","CLP",2.2070358578847729E-4,2.2070358578847729E-4,1.9061171443122051E-5,1.9061171443122051E-5,0]
["6562","CNY",1.0591609067196353E-2,1.0591609067196353E-2,9.1474941635903446E-4,9.1474941635903446E-4,0]
["6562","COP",-4.8422768184609082E-5,-4.8422768184609082E-5,-4.1820556871331909E-6,-4.1820556871331909E-6,0]
["6562","HKD",0.11608698759093619,0.11608698759093619,1.0025908572718543E-2,1.0025908572718543E-2,0]
["6562","IDR",9.1110650474058533E-4,9.1110650474058533E-4,7.8688151929023577E-5,7.8688151929023577E-5,0]
["6562","INR",2.0000181392223593E-2,2.0000181392223593E-2,1.7273252949142471E-3,1.7273252949142471E-3,0]
["6562","KOR",4.464962004200599E-2,4.464962004200599E-2,3.8561859312363209E-3,3.8561859312363209E-3,0]
["6562","MXN",7.6867602794629813E-3,7.6867602794629813E-3,6.6387075228332895E-4,6.6387075228332895E-4,0]
["6562","MYR",4.2192853506395822E-3,4.2192853506395822E-3,3.6440061065919164E-4,3.6440061065919164E-4,0]
["6562","NGN",9.7891920159895603E-4,9.7891920159895603E-4,8.4544828141238306E-5,8.4544828141238306E-5,0]
["6562","NTD",4.8868232416804568E-2,4.8868232416804568E-2,4.2205284200130038E-3,4.2205284200130038E-3,0]
["6562","PHP",5.8242097008084324E-3,5.8242097008084324E-3,5.0301067484332719E-4,5.0301067484332719E-4,0]
["6562","RUB",1.2603148539369474E-2,1.2603148539369474E-2,1.0884769913176327E-3,1.0884769913176327E-3,0]
["6562","THB",9.955435419264148E-3,9.955435419264148E-3,8.5980597297314449E-4,8.5980597297314449E-4,0]
["6562","TRL",2.7860670606810272E-3,2.7860670606810272E-3,2.406200230320353E-4,2.406200230320353E-4,0]
["6562","ZAR",1.289426575104495E-2,1.289426575104495E-2,1.1136194694607296E-3,1.1136194694607296E-3,0]
["6562","AUD",4.5007220730319611E-2,4.5007220730319611E-2,3.8870702868473673E-3,3.8870702868473673E-3,0]
["6562","CHF",2.7476116743011685E-2,2.7476116743011685E-2,2.3729880507320929E-3,2.3729880507320929E-3,0]
["6562","DKK",2.1292041930069193E-2,2.1292041930069193E-2,1.8388974522242734E-3,1.8388974522242734E-3,0]
["6562","ILS",3.261458847956263E-3,3.261458847956263E-3,2.8167746361476358E-4,2.8167746361476358E-4,0]
["6562","NOK",2.4029385299356963E-3,2.4029385299356963E-3,2.0753094301913827E-4,2.0753094301913827E-4,0]
["6562","NZD",7.9321957323994843E-3,7.9321957323994843E-3,6.8506790333970862E-4,6.8506790333970862E-4,0]
["6562","SEK",1.3702602945877631E-2,1.3702602945877631E-2,1.1834319004618507E-3,1.1834319004618507E-3,0]
["6562","SGD",4.0309037865895701E-3,4.0309037865895701E-3,3.4813094618476773E-4,3.4813094618476773E-4,0]
["6570","CAD",98.002511560769904,151.11554543966784,0.51157973632796383,0.78883336416479877]
["6570","CHF",1.5868590768467383,0.80337572838394666,8.2835116691831138E-3,4.1936756186508146E-3,0.49373215296449535]
["6570","EUR",9.1178658829772647,-0.21815387493572619,4.7595876370932079E-2,-1.1387779766168439E-3,1.0239259798000551]
["6570","GBP",1.7757582080378855,0.19499504403171955,9.2695779055307955E-3,1.0178873135220608E-3,0.890190543313226]
["6570","JPY",4.1314450843286368,-0.15594058171261971,2.1566422668501888E-2,-8.1402037973183315E-4,1.0377448032176761]
["6570","USD",65.513329666654116,29.2589651024525,0.34198401023683506,0.15273377604266936,0.55338913086346864]
["6570","BRL",0.70347759935841048,0.83505146464296698,3.6722006309934754E-3,4.3590251035294288E-3,-0.18703348252247864]
["6570","CNY",0.35696538066499067,0.35696538066499067,1.8633834216133279E-3,1.8633834216133279E-3,0]
["6570","DKK",0.58428609384976204,0.58428609384976204,3.0500129136630159E-3,3.0500129136630159E-3,0]
["6570","HKD",3.087541716381033,3.0051850516105554,1.611717650917914E-2,1.568726915091714E-2,2.667386300678376E-2]
["6570","NOK",0.44565988233447168,0.28050408581480768,2.3263747169912767E-3,1.4642502929230899E-3,0.37058708460483125]
["6570","NTD",1.1562331190028527,1.2647759248938142,6.035615054481077E-3,6.6022158398452678E-3,-9.3876229721364446E-2]
["6570","SEK",0.57751071788152775,0.69588910635090107,3.0146449930235244E-3,3.6325881844338683E-3,-0.20498041820525637]
["6570","AUD",0.5057199545084391,0.49664704644861857,2.6398923544198264E-3,2.5925311609253853E-3,1.7940577544818037E-2]
["6570","KOR",0.87798206922367517,0.69477567312337629,4.5831257619924539E-3,3.6267759877066171E-3,0.20866758276999064]
["6570","SGD",2.6277636274768975E-2,-8.0353973090165204E-2,1.3717103799357815E-4,-4.1945317228814986E-4,4.0578843641016054]
["6570","NZD",0.47193734084657091,-0.12092776390070119,2.4635448270516999E-3,-6.312511035259531E-4,1.2562369056955283]
["6570","CLP",2.5607263795766395E-2,2.5607263795766395E-2,1.3367164832908974E-4,1.3367164832908974E-4,0]
["6570","COP",8.8117916390972797E-3,2.6799120340796918E-2,4.5998148124102301E-5,1.3989322007594633E-4,-2.0412793945207652]
["6570","IDR",3.5034488805511389E-2,0.13443089627782148,1.8288240025761759E-4,7.0173836748556383E-4,-2.8371016921095684]
["6570","INR",0.26891413279133092,0.48584471454845374,1.4037499545401586E-3,2.5361422580574547E-3,-0.80669089238777292]
["6570","MXN",0.8412373987567684,0.27334670936254291,4.3913160978364301E-3,1.4268883039297866E-3,0.67506590913990361]
["6570","PEN",-1.0098731980667253E-4,5.9977442391138523E-2,-5.2716063717540332E-7,3.1308630437555738E-4,594.91062666043376]
["6570","PHP",9.1337444763503542E-2,0.12801563245992145,4.7678763701896313E-4,6.682502566181137E-4,-0.40156791983164508]
["6570","RUB",0.63831300154179538,0.63831300154179538,3.3320370245917144E-3,3.3320370245917144E-3,0]
["6570","THB",0.15669888635251222,0.22814890737903532,8.179787812212882E-4,1.1909527217382164E-3,-0.45597019027811103]
["6570","ZAR",0.35957371930148418,0.46847110786753754,1.8769991256464228E-3,2.44545085654804E-3,-0.30285135626040693]
["6570","AED",4.8853281335230828E-2,4.8853281335230828E-2,2.5501743155567841E-4,2.5501743155567841E-4,0]
["6570","EGP",5.6647153457290475E-4,5.6647153457290475E-4,2.9570197097898439E-6,2.9570197097898439E-6,0]
["6570","MYR",8.110186812539634E-2,8.110186812539634E-2,4.233572349374758E-4,4.233572349374758E-4,0]
["6570","NGN",1.3338321943962119E-2,1.3338321943962119E-2,6.9626942355639648E-5,6.9626942355639648E-5,0]
["6570","PKR",5.9999139210515783E-4,5.9999139210515783E-4,3.1319956323963547E-6,3.1319956323963547E-6,0]
["6570","TRL",4.5646986334496313E-2,0.13880210855414332,2.3828035487322708E-4,7.2455639110700573E-4,-2.0407726708838143]
["6570","ILS",2.7246861688327297E-6,-0.15202062424520302,1.4223046018198876E-8,-7.9355793672235622E-4,55794.810672268904]
["6570","PLN",1.7359198505379245E-2,-5.7718994471973165E-2,9.0616189858970709E-5,-3.0129705354313738E-4,4.3249803816741466]
["6570","CZK",7.4978261021194682E-3,7.4978261021194682E-3,3.9139159183453371E-5,3.9139159183453371E-5,0]
["6570","HUF",6.675670657929564E-3,6.8068495374239884E-3,3.4847452178592943E-5,3.5532214798599288E-5,-1.9650292265183333E-2]
["6570","RON",-1.0159599846707873E-4,-1.0159599846707873E-4,-5.3033798093568008E-7,-5.3033798093568008E-7,0]
["6573","CAD",8.6681536092263247,21.029243453366554,0.31397821639867157,0.76172212092245062]
["6573","CHF",0.38561975474064403,0.21619713165707893,1.3967934609821391E-2,7.8311013911827928E-3,0.43935151402581418]
["6573","EUR",1.579112083690863,0.23196933155405422,5.7198662815932735E-2,8.4024026642779762E-3,0.85310141442786525]
["6573","GBP",0.32265752949110749,0.22341716966540764,1.1687314298328625E-2,8.0926259047507977E-3,0.30757180835736531]
["6573","JPY",1.1838778942294703,0.20298458163496244,4.2882473756387589E-2,7.3525158610871118E-3,0.82854263718888388]
["6573","USD",13.293601770356123,4.1769843878126984,0.48152138985261694,0.15129890021960332,0.68578986643581386]
["6573","BRL",0.17755449602633655,0.20369292956941557,6.4313862546893615E-3,7.3781736690904853E-3,-0.14721358302975274]
["6573","CNY",6.0534490409851878E-2,6.0534490409851878E-2,2.1926828003206332E-3,2.1926828003206332E-3,0]
["6573","DKK",8.2851895045958135E-2,8.2851895045958135E-2,3.0010647485631853E-3,3.0010647485631853E-3,0]
["6573","HKD",0.25976828075579733,0.24591296907140259,9.4093373451343779E-3,8.9074696756824261E-3,5.3337195919696767E-2]
["6573","NOK",0.14647801296653204,4.0694380712295156E-2,5.305732607680233E-3,1.474033531188813E-3,0.72218096157821865]
["6573","NTD",5.8484047585760993E-2,0.11222240026581078,2.1184115760485736E-3,4.0649243961173873E-3,-0.91885488262842752]
["6573","SEK",0.14679087507196042,0.16369281626949858,5.317065111725452E-3,5.9292879206555675E-3,-0.11514299638347691]
["6573","NZD",0.235988731078835,-4.7630461754551962E-2,8.5479935191102065E-3,-1.7252725438577183E-3,1.2018336279737036]
["6573","AUD",0.18997061275500493,6.7946419737946281E-2,6.8811233452867855E-3,2.4611580091622306E-3,0.64233194412246708]
["6573","CLP",1.4950500587901944E-2,1.4950500587901944E-2,5.4153764694021356E-4,5.4153764694021356E-4,0]
["6573","COP",5.7769790893465438E-3,1.4668496882780015E-2,2.0925397407757108E-4,5.3132289713954601E-4,-1.5391293019963528]
["6573","IDR",1.3632860643334832E-2,4.2657705849978605E-2,4.9381003869726817E-4,1.5451491750422387E-3,-2.1290355682491446]
["6573","INR",0,4.0205043592507726E-2,0,1.456308741918237E-3]
["6573","KOR",0,-1.4184756377736139E-2,0,-5.1380082867829896E-4]
["6573","MXN",0.38153138772321116,3.9428593278611167E-2,1.3819845611634924E-2,1.4281841267268375E-3,0.8966570129029191]
["6573","PEN",-6.3385471514010972E-5,2.9603105318531529E-2,-2.2959511550850663E-6,1.0722848978912082E-3,468.03297477227005]
["6573","PHP",7.373540152098919E-3,2.5517875577612471E-2,2.6708467453043266E-4,9.2430953826360481E-4,-2.460735962812743]
["6573","RUB",0.24596987479875759,0.24596987479875759,8.909530917278188E-3,8.909530917278188E-3,0]
["6573","THB",1.3760405516530469E-2,4.9132659204703104E-2,4.9842997433778753E-4,1.7796852016554597E-3,-2.5705822147232293]
["6573","ZAR",9.5914625105110118E-2,0.1120477671587494,3.4742234938009643E-3,4.0585988285338909E-3,-0.16820314979034134]
["6573","ILS",4.5838884098266081E-7,-2.5575260208067351E-2,1.6603779443363607E-8,-9.2638812670713935E-4,55794.810672268897]
["6573","MYR",1.4034742634280626E-2,1.4034742634280626E-2,5.083670246954858E-4,5.083670246954858E-4,0]
["6573","PLN",1.0895635060671019E-2,-1.7351795467612525E-3,3.9466214110915582E-4,-6.2851744879516532E-5,1.1592545580958904]
["6573","SGD",-9.8411111217853661E-4,-1.8923329356108604E-2,-3.5646513164123395E-5,-6.8544161391319758E-4,-18.228854467680829]
["6573","TRL",4.3145990260445863E-3,1.9986594206375965E-2,1.5628358330325407E-4,7.2395523703254418E-4,-3.6323178783773793]
["6573","CZK",4.7060684818917252E-3,4.7060684818917252E-3,1.704634060270479E-4,1.704634060270479E-4,0]
["6573","HUF",4.1900362652970927E-3,4.2723717025118972E-3,1.5177166586243204E-4,1.5475402345420256E-4,-1.9650292265183111E-2]
["6573","RON",-6.3767513377922436E-5,-6.3767513377922436E-5,-2.3097894911861791E-6,-2.3097894911861791E-6,0]
["6580","CAD",0.5273510626302268,2.490918691167618,2.3662142113019282E-2,0.11176704900984076]
["6580","CHF",0.23466732533897866,0.55819779811635817,1.0529478358795993E-2,2.5046229280977363E-2,-1.3786771222198801]
["6580","EUR",2.1900746844879229,2.0653497265764074,9.8268235516605101E-2,9.2671850322228383E-2,5.6950093435137017E-2]
["6580","GBP",1.5543329688710448,1.3455198326901467,6.9742625371681077E-2,6.0373219574461304E-2,0.13434260249434504]
["6580","JPY",1.7408992010346431,0.91155071343863392,7.8113816807093159E-2,4.090110754120771E-2,0.47639087151232806]
["6580","USD",10.992510252924033,10.267908884738349,0.49323184917121121,0.46071912327703735,6.5917734122007188E-2]
["6580","AUD",0.82836764082585657,0.61941944300773655,3.7168698857428718E-2,2.7793232870175332E-2,0.25224089826807483]
["6580","DKK",0.25725153487505414,0.25725153487505414,1.1542827555225949E-2,1.1542827555225949E-2,0]
["6580","HKD",1.4604910554579609,1.3413676483037524,6.553195652375457E-2,6.0186911848939165E-2,8.1563941599666512E-2]
["6580","KOR",0.56476087076924364,0.55360260791231852,2.5340713105540237E-2,2.4840043968479789E-2,1.9757499916250865E-2]
["6580","NOK",6.7203445591066169E-2,6.7203445591066169E-2,3.0154058515197931E-3,3.0154058515197931E-3,0]
["6580","NTD",0.58920877671606997,0.55944630120133199,2.643768600627594E-2,2.510224937749115E-2,5.0512614018782709E-2]
["6580","SEK",0.2605960303724677,0.23001549480475725,1.1692894433562067E-2,1.0320751605430918E-2,0.11734843206936785]
["6580","SGD",4.235645544259535E-2,4.235645544259535E-2,1.9005261183842987E-3,1.9005261183842987E-3,0]
["6580","AED",2.718944255371995E-2,2.718944255371995E-2,1.2199851280683075E-3,1.2199851280683075E-3,0]
["6580","BRL",0.17129940364399351,0.17129940364399351,7.6861717366857145E-3,7.6861717366857145E-3,0]
["6580","CNY",8.4630692557032067E-2,8.4630692557032067E-2,3.7973631159854112E-3,3.7973631159854112E-3,0]
["6580","EGP",1.3903786874744502E-5,1.3903786874744502E-5,6.2386027876466691E-7,6.2386027876466691E-7,0]
["6580","IDR",7.2980428247221068E-3,7.2980428247221068E-3,3.2746179670934262E-4,3.2746179670934262E-4,0]
["6580","INR",0.1596299762152131,0.1596299762152131,7.1625667422818588E-3,7.1625667422818588E-3,0]
["6580","MXN",6.1364382428218005E-2,6.1364382428218005E-2,2.7534081953908838E-3,2.7534081953908838E-3,0]
["6580","MYR",3.3680692947158461E-2,3.3680692947158461E-2,1.5112463014783912E-3,1.5112463014783912E-3,0]
["6580","NGN",7.8174958615106725E-3,7.8174958615106725E-3,3.5076955590153196E-4,3.5076955590153196E-4,0]
["6580","PKR",1.4726516573866327E-5,1.4726516573866327E-5,6.6077600424766013E-7,6.6077600424766013E-7,0]
["6580","PHP",4.6516914072071605E-2,4.6516914072071605E-2,2.0872051076234526E-3,2.0872051076234526E-3,0]
["6580","RUB",0.10074755739621916,0.10074755739621916,4.5205237830732749E-3,4.5205237830732749E-3,0]
["6580","THB",7.9481127168072138E-2,7.9481127168072138E-2,3.5663030941356119E-3,3.5663030941356119E-3,0]
["6580","TRL",2.2269005406565748E-2,2.2269005406565748E-2,9.9920604695023264E-4,9.9920604695023264E-4,0]
["6580","ZAR",0.10284772913344263,0.10284772913344263,4.6147580904056067E-3,4.6147580904056067E-3,0]
["6580","CLP",1.7325733284523626E-3,1.7325733284523626E-3,7.7740236484197416E-5,7.7740236484197416E-5,0]
["6580","COP",-3.8012973983527122E-4,-3.8012973983527122E-4,-1.705634929510745E-5,-1.705634929510745E-5,0]
["6580","ILS",2.0542660938168963E-2,2.0542660938168963E-2,9.2174529823477516E-4,9.2174529823477516E-4,0]
["6580","NZD",4.9961816175599534E-2,4.9961816175599534E-2,2.2417772113233242E-3,2.2417772113233242E-3,0]
["6586","CAD",1.8588026379810951,4.0806283696643932,0.40892349480400719,0.89770951462169857]
["6586","MXN",0.10750350124301158,4.9497672134444122E-3,2.365001347303141E-2,1.0889139417116359E-3,0.95395715343023602]
["6586","NZD",8.8859875777566488E-2,-1.3289809844950361E-2,1.9548547117556866E-2,-2.9236646086216035E-3,1.1495591764973578]
["6586","USD",1.8117585287836415,8.8395772473848611E-2,0.39857412196049841,1.9446447657921639E-2,0.95120995923601648]
["6586","AUD",6.8337615334873772E-2,9.7279690950678351E-3,1.5033794292254878E-2,2.1400847182039412E-3,0.85764839689828187]
["6586","BRL",4.2647627239936287E-2,4.4599418217991911E-2,9.3821777630975645E-3,9.8115580381010013E-3,-4.5765523298044508E-2]
["6586","CHF",0,-1.8321160334308837E-3,0,-4.0305262967064493E-4]
["6586","CLP",5.3254575657675669E-3,5.3254575657675669E-3,1.1715631744472824E-3,1.1715631744472824E-3,0]
["6586","COP",2.0577944409123591E-3,4.9172282799556126E-3,4.5270029059142007E-4,1.0817556054108616E-3,-1.3895624277104539]
["6586","EUR",8.6762379268387521E-2,3.4537931831632222E-2,1.9087112651440408E-2,7.5981018636994508E-3,0.60192502645883117]
["6586","GBP",2.6544082538971052E-2,1.8941145071001985E-2,5.8395112942122166E-3,4.1669185742260612E-3,0.28642683192409124]
["6586","IDR",4.856106351037625E-3,1.0853971688893359E-2,1.0683092113335148E-3,2.3877973620409537E-3,-1.2351182005258483]
["6586","INR",0,1.8085722086055363E-3,0,3.9787315395229154E-4]
["6586","JPY",0.25145262636554638,5.364875769689996E-2,5.5317807630576026E-2,1.1802349018149411E-2,0.78664467151395479]
["6586","KOR",0,8.1109887917840875E-3,0,1.7843604346585902E-3]
["6586","NOK",3.5705732987490441E-2,-2.2579166075447007E-3,7.8550098969311956E-3,-4.9672575843556419E-4,1.0632368087314092]
["6586","NTD",0,1.7296241899379304E-2,0,3.805051456216848E-3]
["6586","PEN",-2.2578283372477013E-5,9.5130576974079041E-3,-4.9670633959162734E-6,2.0928057236465824E-3,422.33662424506315]
["6586","PHP",2.6264990231338243E-3,8.4639993112442923E-3,5.7781129512799725E-4,1.8620202638253019E-3,-2.2225404375537963]
["6586","RUB",7.0686884435426867E-2,7.0686884435426867E-2,1.5550616956051318E-2,1.5550616956051318E-2,0]
["6586","SEK",3.3794077521882952E-2,3.232357889679998E-2,7.4344591521213815E-3,7.1109598065821848E-3,4.3513500971605668E-2]
["6586","THB",4.9015385963287429E-3,1.6286182485401007E-2,1.0783039854647886E-3,3.5828454957323582E-3,-2.3226673962333733]
["6586","ZAR",2.9604374594050922E-2,2.85379809139212E-2,6.5127540025631207E-3,6.2781549001058607E-3,3.6021489889673797E-2]
["6586","CZK",1.6763296890667928E-3,1.6763296890667928E-3,3.6878073061131486E-4,3.6878073061131486E-4,0]
["6586","HUF",1.4925159327389627E-3,1.521844307027726E-3,3.2834299822662855E-4,3.3479503410500835E-4,-1.9650292265183333E-2]
["6586","MYR",4.8505843624488112E-3,4.8505843624488112E-3,1.0670944127175316E-3,1.0670944127175316E-3,0]
["6586","PLN",3.8810902569139712E-3,3.8810902569139712E-3,8.5381253451996899E-4,8.5381253451996899E-4,0]
["6586","RON",-2.2714368965239949E-5,-2.2714368965239949E-5,-4.9970012683122025E-6,-4.9970012683122025E-6,0]
["6586","TRL",1.5368859317724682E-3,1.5368859317724682E-3,3.3810408565920189E-4,3.3810408565920189E-4,0]
["6592","CAD",25.625135123799158,61.117450280131393,0.2474658197067621,0.5902204947950983]
["6592","CHF",2.1142711848351174,1.0864488204191196,2.0417837771777528E-2,1.049200117835716E-2,0.48613554012757976]
["6592","EUR",8.7263132304302982,1.6351398701640565,8.4271331493616611E-2,1.5790793935347845E-2,0.81261962217193673]
["6592","GBP",1.8106765449779292,1.4000837501520276,1.7485978249949581E-2,1.3520821303599873E-2,0.22676208843855461]
["6592","JPY",4.2046659343415156,1.2159562548457181,4.0605097183216601E-2,1.1742674131442702E-2,0.71080788014229079]
["6592","USD",49.258261520168539,26.669087321900456,0.47569450875197283,0.25754742455254026,0.45858650916900634]
["6592","BRL",0.83784579819774574,0.91214216158551109,8.0912040555956993E-3,8.808695314789455E-3,-8.867546217643052E-2]
["6592","CNY",0.47734214435705924,0.47734214435705924,4.6097655471168501E-3,4.6097655471168501E-3,0]
["6592","DKK",0.6026185517069409,0.6026185517069409,5.8195788294657172E-3,5.8195788294657172E-3,0]
["6592","HKD",2.7530244160631043,2.711357779051998,2.6586374686510546E-2,2.61839936480277E-2,1.5134859236261566E-2]
["6592","NOK",0.54064312582322949,0.30615812614973464,5.2210727340288041E-3,2.9566154980843556E-3,0.43371493777239456]
["6592","NTD",1.1462590755788193,1.2696850859301718,1.1069597891446075E-2,1.2261541609095606E-2,-0.10767723718045752]
["6592","SEK",0.62278560675729444,0.67686379358484694,6.0143351413835455E-3,6.5365764004786751E-3,-8.6832749891452288E-2]
["6592","AUD",0.55667011379103259,0.31872459136788689,5.3758477896810684E-3,3.0779717602465945E-3,0.42744439934576339]
["6592","KOR",0.78021475575428967,0.71965324898304417,7.5346523305052978E-3,6.949800666566015E-3,7.7621586011528798E-2]
["6592","SGD",1.7710416893062166E-2,-3.6237622087159957E-2,1.7103218432279382E-4,-3.4995221725462586E-4,3.0461190894583399]
["6592","NZD",0.52001068857503618,-0.11380505638184464,5.0218221555828595E-3,-1.0990327047349464E-3,1.2188513791778011]
["6592","CLP",3.532114061070684E-2,3.532114061070684E-2,3.4110161651746535E-4,3.4110161651746535E-4,0]
["6592","COP",1.238170039223664E-2,3.2809257806205576E-2,1.1957196019164269E-4,3.1684398297835808E-4,-1.6498184229023236]
["6592","IDR",4.3354307721856E-2,0.11740037653232378,4.1867913071974751E-4,1.1337532571865992E-3,-1.7079287549813484]
["6592","INR",0.26912551852500277,0.38604054199281029,2.5989859848170528E-3,3.7280521137845247E-3,-0.43442563198237072]
["6592","MXN",0.97061484381980356,0.21062895358436562,9.3733748830982806E-3,2.0340757775877362E-3,0.78299430003002379]
["6592","PEN",-1.4088621726580182E-4,6.8025193044517138E-2,-1.3605595862277603E-6,6.5692961524475217E-4,483.83781312814983]
["6592","PHP",9.5714130671938916E-2,0.13739339179479002,9.243258890078331E-4,1.3268288404540988E-3,-0.43545567232603477]
["6592","RUB",0.73090817798376895,0.73090817798376895,7.0584912243894168E-3,7.0584912243894168E-3,0]
["6592","THB",0.16523157023413443,0.2464749458849112,1.5956663553922099E-3,2.3802459665448372E-3,-0.49169402394260531]
["6592","ZAR",0.39076339164943108,0.4416341537352993,3.7736613898324781E-3,4.2649280613200101E-3,-0.13018302935477211]
["6592","AED",4.8078228733143422E-2,4.8078228733143422E-2,4.6429875300234497E-4,4.6429875300234497E-4,0]
["6592","EGP",4.220676341080711E-4,4.220676341080711E-4,4.075971211142722E-6,4.075971211142722E-6,0]
["6592","MYR",8.8442720969931513E-2,8.8442720969931513E-2,8.5410478173805087E-4,8.5410478173805087E-4,0]
["6592","NGN",1.3303756608201017E-2,1.3303756608201017E-2,1.2847639703449166E-4,1.2847639703449166E-4,0]
["6592","PKR",4.47042670099852E-4,4.47042670099852E-4,4.317158924848547E-6,4.317158924848547E-6,0]
["6592","TRL",4.805772422020918E-2,9.5187615578348247E-2,4.6410073780841739E-4,9.1924125282566568E-4,-0.98069336663095785]
["6592","ILS",1.3784981444104356E-6,-7.691166448130983E-2,1.3312365832325149E-8,-7.4274761884873071E-4,55794.810672268897]
["6592","PLN",2.4217612833680232E-2,-1.3766633164568724E-2,2.3387316329355454E-4,-1.3294646620256383E-4,1.5684554154496604]
["6592","CZK",1.046012865047447E-2,1.046012865047447E-2,1.0101505019279992E-4,1.0101505019279992E-4,0]
["6592","HUF",9.3131492994218516E-3,9.4961554050647778E-3,8.9938496491767775E-5,9.1705814233722171E-5,-1.9650292265183333E-2]
["6592","RON",-1.4173537767682383E-4,-1.4173537767682383E-4,-1.368760057216923E-6,-1.368760057216923E-6,0]
["6602","CAD",1.9758134987811721E-2,0.36855122658523221,3.3052519301100271E-3,6.1653321721240627E-2]
["6602","CHF",0,1.304658E-2,0,2.1825052694971394E-3]
["6602","EUR",0.31174333305254681,5.8761013052546822E-2,5.2150177833408078E-2,9.8298727044308642E-3,0.8115083569641498]
["6602","GBP",0,3.2329249999999997E-2,0,5.4082187426812535E-3]
["6602","USD",5.5964738289377074,5.4553100456009549,0.93620961372707479,0.91259494221970539,2.5223701146753541E-2]
["6602","BRL",6.0623337303545785E-4,6.0623337303545785E-4,1.014141277786908E-4,1.014141277786908E-4,0]
["6602","HKD",4.9224530399005921E-2,4.9224530399005921E-2,8.234556257988879E-3,8.234556257988879E-3,0]
["724","CAD",1977.3753674875165,2499.0461224247879,0.63263142518096926,0.79953211515493883]
["724","EUR",228.9651895915012,73.52980293266657,7.3253959055913392E-2,2.3524751439416489E-2,0.67886034089351432]
["724","HKD",68.169951560000001,68.169951560000001,2.1809947832372147E-2,2.1809947832372147E-2,0]
["724","NZD",4.1695762196758954,-7.5356138126480482E-2,1.3339930240993522E-3,-2.4109059839085048E-5,1.0180728530086298]
["724","USD",844.90781416085053,483.89950055761057,0.27031551186878577,0.1548163468179003,0.4272753873886086]
["724","AUD",8.0473594603021309E-2,2.9480112281600614E-2,2.5746312855020601E-5,9.4317172924536966E-6,0.63366726157782682]
["724","BRL",0.12218861519949981,0.1293458962170537,3.9092404530540716E-5,4.1382268642840779E-5,-5.8575678313957935E-2]
["724","CHF",5.2039027361440596E-3,3.3523864688301413E-5,1.6649101928750236E-6,1.072545488532186E-8,0.99355793788084101]
["724","CLP",7.8505622044522782E-3,7.8505622044522782E-3,2.5116689716758347E-6,2.5116689716758347E-6,0]
["724","COP",4.0605875673951578E-3,1.4399858541479418E-2,1.2991237486170118E-6,4.6070175553342379E-6,-2.5462499705964574]
["724","GBP",0.3851125316215776,6.1828543129267097E-2,1.2321094605541446E-4,1.9781109848875573E-5,0.83945330766327397]
["724","IDR",9.5824173119203482E-3,3.121643605742401E-2,3.0657498927083371E-6,9.9872278965280592E-6,-2.2576786254749464]
["724","INR",0,6.6568779328086908E-3,0,2.1297676926356745E-6]
["724","JPY",0.16967882337172926,2.9100008054587793E-2,5.4286180366998391E-5,9.3101086779203962E-6,0.82849947049175354]
["724","KOR",0,2.9256073957643271E-2,0,9.3600396097482733E-6]
["724","MXN",0.66479320998935754,1.4025497780972175E-2,2.1269056083194772E-4,4.4872464762839047E-6,0.97890246535280245]
["724","NOK",3.1468644982868568E-2,-6.249003351196495E-3,1.0067918338297891E-5,-1.99927437199303E-6,1.198578723507111]
["724","NTD",0,6.2516916957482002E-2,0,2.0001344672855511E-5]
["724","PEN",-4.4553087972555969E-5,3.4534649925045645E-2,-1.4254088527513289E-8,1.1048840376709815E-5,776.13482222194045]
["724","PHP",5.182796234197309E-3,2.6325525583882917E-2,1.6581574859147241E-6,8.4224548573856247E-6,-4.0794058639969109]
["724","RUB",0.38447305187051195,0.38447305187051195,1.230063541539764E-4,1.230063541539764E-4,0]
["724","SEK",6.0041828412266039E-2,5.5871871072845601E-2,1.9209477423189797E-5,1.7875362465576394E-5,6.9450871995239805E-2]
["724","THB",9.6720674765432869E-3,5.0842660557875494E-2,3.0944321107361574E-6,1.6266342414080915E-5,-4.2566486618480681]
["724","ZAR",8.1515133493671121E-2,7.7570564551081342E-2,2.6079537514135485E-5,2.4817532174680926E-5,4.8390633414052364E-2]
["724","CZK",3.307853961964276E-3,3.307853961964276E-3,1.0582979846193452E-6,1.0582979846193452E-6,0]
["724","HUF",2.9451394756086491E-3,3.003012327066088E-3,9.4225295532958273E-7,9.6076850128954186E-7,-1.9650292265183333E-2]
["724","MYR",9.5715209280225044E-3,9.5715209280225044E-3,3.0622637590242855E-6,3.0622637590242855E-6,0]
["724","PLN",7.6584456308357498E-3,7.6584456308357498E-3,2.4502041715340499E-6,2.4502041715340499E-6,0]
["724","RON",-4.4821621823696988E-5,-4.4821621823696988E-5,-1.434000188303998E-8,-1.434000188303998E-8,0]
["724","TRL",3.0326935397361177E-3,3.0326935397361177E-3,9.702645576181887E-7,9.702645576181887E-7,0]
["734","AUD",2.7181542331754018,2.7181542331754018,1.7103538703687006E-2,1.7103538703687006E-2,0]
["734","CAD",7.4904985994294879,18.063098599429487,4.713273115322459E-2,0.11365907873555194]
["734","CHF",5.4700230055826937,5.4700230055826937,3.4419220603514857E-2,3.4419220603514857E-2,0]
["734","EUR",19.944052808241818,18.878217858241818,0.12549467390437422,0.11878808268281166,5.3441241870335721E-2]
["734","GBP",1.6377692117505906,8.3426603417505909,1.0305393549415854E-2,5.2494818838941949E-2,-4.0939169462303102]
["734","HKD",1.2727978173749097,1.2727978173749097,8.0088710440866812E-3,8.0088710440866812E-3,0]
["734","JPY",7.2963659778283816,17.216792497828386,4.5911183543204004E-2,0.10833383670651846,-1.3596393807746776]
["734","KOR",4.0451750000000004,4.0451750000000004,2.5453598744049812E-2,2.5453598744049812E-2,0]
["734","NOK",1.2391030000000001,1.2391030000000001,7.7968519444890153E-3,7.7968519444890153E-3,0]
["734","USD",106.25911273625445,80.12708018625446,0.66861800008340144,0.50418648083042761,0.24592744920487208]
["734","ZAR",1.176604,1.176604,7.4035872605373023E-3,7.4035872605373023E-3,0]
["734","DKK",0.14454877322755597,0.14454877322755597,9.095493946933963E-4,9.095493946933963E-4,0]
["734","SEK",0.22930717378582532,0.22930717378582532,1.4428776976710513E-3,1.4428776976710513E-3,0]
["736","CAD",69.438000000000002,138.2183,3.9851665350004867E-2,7.9325865330893419E-2]
["736","CHF",102.504772,102.504772,5.8829255890471339E-2,5.8829255890471339E-2,0]
["736","EUR",141.767786,141.767786,8.1362976541419746E-2,8.1362976541419746E-2,0]
["736","GBP",100.56561600000001,100.56561600000001,5.7716340829935986E-2,5.7716340829935986E-2,0]
["736","HKD",119.061261,119.061261,6.833131037071323E-2,6.833131037071323E-2,0]
["736","JPY",183.66392648000001,183.66392648000001,0.10540789387581523,0.10540789387581523,0]
["736","KOR",46.729238000000002,46.729238000000002,2.6818715326431215E-2,2.6818715326431215E-2,0]
["736","USD",978.68084899999997,909.90055069000005,0.56168181224699221,0.52220761323602383,7.0278577924844932E-2]
["738","CAD",320.87830000000002,331.41699999999997,0.60387083102875205,0.62370393762076115]
["738","CHF",17.199081,17.199081,3.2367484296696968E-2,3.2367484296696968E-2,0]
["738","EUR",6.0263609999999996,6.0263609999999996,1.134119579027083E-2,1.134119579027083E-2,0]
["738","HKD",13.016223,13.016223,2.4495634014096792E-2,2.4495634014096792E-2,0]
["738","JPY",13.881083369999999,13.881083369999999,2.6123241584804231E-2,2.6123241584804231E-2,0]
["738","KOR",10.301976,10.301976,1.938760834982689E-2,1.938760834982689E-2,0]
["738","USD",150.06606500000001,139.52733603000001,0.28241398493062547,0.26258082381907422,7.0227262705928828E-2]
["740","CAD",417.18602679122966,552.03820964155864,0.6322045459199841,0.83655981563249115]
["740","CHF",12.610082171671662,12.606790205196528,1.9109343941053986E-2,1.9104355288421963E-2,2.6105828894029681E-4]
["740","EUR",3.6275424302602639,3.2148067110846248,5.4971851108422069E-3,4.8717245700533604E-3,0.11377832985016989]
["740","GBP",0.27584223412529735,4.4147973819653241E-2,4.1801187760779447E-4,6.6901928515233723E-5,0.83995208725144077]
["740","HKD",9.8401820000000004,9.8401820000000004,1.4911831637623735E-2,1.4911831637623735E-2,0]
["740","JPY",10.461048508791073,2.4571577737945369,1.5852693996524385E-2,3.7235818432933944E-3,0.76511362396134253]
["740","KOR",7.6310950000000002,7.6601459861138457,1.1564176744974055E-2,1.1608200667888958E-2,-3.8069223504419991E-3]
["740","NZD",5.3712482904829315,-6.7382117009350817E-3,8.1396004862060254E-3,-1.0211099593789036E-5,1.0012544964106154]
["740","USD",191.42215602483765,71.10192110951597,0.29008152108907342,0.107747994569278,0.628559605711001]
["740","AUD",0.11000629844485657,1.7701173735758958E-2,1.6670376640268348E-4,2.6824394359369039E-5,0.83908945227684284]
["740","BRL",0.12298224413054709,0.12997473020945255,1.8636754065035158E-4,1.9696396814905699E-4,-5.6857688102380566E-2]
["740","CLP",1.0696262949792654E-2,1.0696262949792654E-2,1.6209138434539185E-5,1.6209138434539185E-5,0]
["740","COP",5.3762019034469819E-3,1.5731824641737654E-2,8.1471072012767287E-6,2.3840038772678416E-5,-1.9261967694425888]
["740","IDR",1.2687082678780237E-2,3.4231816426996867E-2,1.9226030664736001E-5,5.1874963614435151E-5,-1.6981629499625823]
["740","INR",0,6.6347941802009135E-3,0,1.0054380474410108E-5]
["740","MXN",0.60537629488216094,1.6108071296703528E-2,9.1738845751950958E-4,2.4410203712012891E-5,0.97339163850173716]
["740","NOK",4.3314809109282405E-2,-3.9653024390839649E-3,6.5639349033730276E-5,-6.0090273090354249E-6,1.0915461136878055]
["740","NTD",0,6.2123336051178965E-2,0,9.4141828673768594E-5]
["740","PEN",-5.8988112529771395E-5,3.4325644257777232E-2,-8.9390704629767429E-8,5.2017150498328182E-5,582.90782491053642]
["740","PHP",6.8620017465462159E-3,2.7900871114676373E-2,1.0398691278431352E-5,4.2281036326878236E-5,-3.0659959214844914]
["740","RUB",0.33403113717612126,0.33403113717612126,5.0619145858220088E-4,5.0619145858220088E-4,0]
["740","SEK",8.2644179235089571E-2,7.9962182510307137E-2,1.2523915579846544E-4,1.2117485255563781E-4,3.2452336626796474E-2]
["740","THB",1.2805779142700943E-2,5.3702720835472624E-2,1.9405903525417524E-5,8.1381211402479749E-5,-3.1936316593498475]
["740","ZAR",8.3841092302558484E-2,7.9919585479848759E-2,1.270529602735217E-4,1.2111030092981848E-4,4.6773088410610564E-2]
["740","CZK",4.3795855824986215E-3,4.3795855824986215E-3,6.6368328196352174E-6,6.6368328196352174E-6,0]
["740","HUF",3.8993530349700758E-3,3.9759764617523672E-3,5.9090874491072322E-6,6.0252027445027159E-6,-1.9650292265183333E-2]
["740","MYR",1.2672655909530714E-2,1.2672655909530714E-2,1.9204168309535279E-5,1.9204168309535279E-5,0]
["740","PLN",1.0139751771036631E-2,1.0139751771036631E-2,1.5365800272494485E-5,1.5365800272494485E-5,0]
["740","RON",-5.9343650288207279E-5,-5.9343650288207279E-5,-8.9929487265557499E-8,-8.9929487265557499E-8,0]
["740","TRL",4.0152742701125479E-3,4.0152742701125479E-3,6.0847547225042019E-6,6.0847547225042019E-6,0]
["756","CAD",147.30109999999999,401.08069999999998,0.32785794620009245,0.89271223746798511]
["756","USD",301.98223150999996,48.202614920000016,0.67214212393382966,0.10728779574046045,0.84037930086491253]
["C11","CAD",37.186810047461307,46.931056382033745,0.45090662009842597,0.56905994313207209]
["C11","CHF",1.3031538985077127,1.6424693003366777,1.5801320927884069E-2,1.9915671171714219E-2,-0.26038014559717548]
["C11","EUR",4.1592655167967161,3.8973221721042139,5.0432945280251967E-2,4.7256765660063316E-2,6.2978269512892093E-2]
["C11","GBP",1.525820332485442,2.336985433336205,1.8501250527280334E-2,2.8336988346673808E-2,-0.53162556795231475]
["C11","JPY",2.4030152492997381,2.4928405568391523,2.9137629248752753E-2,3.0226801075274184E-2,-3.7380248654514503E-2]
["C11","USD",26.257394787512744,14.897112378834139,0.31838259643988137,0.18063411686545289,0.43265078278372182]
["C11","BRL",0.5663393615799488,0.723969053442023,6.8671167823427907E-3,8.7784469419872994E-3,-0.27833080756090434]
["C11","CNY",0.1477482816843248,0.1477482816843248,1.791513663973906E-3,1.791513663973906E-3,0]
["C11","DKK",0.23983326769772056,0.23691707340316553,2.9080850975579421E-3,2.8727249440188276E-3,1.2159256814323727E-2]
["C11","HKD",2.7680108599140771,2.7414084424098268,3.3563363451896873E-2,3.3240797301480114E-2,9.6106622591343172E-3]
["C11","NOK",0.13542799820552398,0.14905531901132538,1.6421247442200912E-3,1.8073620732004067E-3,-0.10062410274366407]
["C11","NTD",0.94303986557927388,0.95210574433751793,1.1434778026502269E-2,1.1544705840796763E-2,-9.6134628971122904E-3]
["C11","SEK",0.66885860763394178,0.84532340669683226,8.1102082622047673E-3,1.0249922478354047E-2,-0.26382974973907714]
["C11","NZD",0.10530239898289913,7.6458830348947373E-3,1.2768384476386802E-3,9.2709734245345496E-5,0.92739117903537593]
["C11","AUD",0.94210021583978731,1.3441172037509086,1.142338435526326E-2,1.6298019232785611E-2,-0.42672422864563697]
["C11","CLP",4.861985220970459E-3,4.861985220970459E-3,5.8953734406319527E-5,5.8953734406319527E-5,0]
["C11","IDR",0.12935384289814514,0.22182821977672079,1.5684729080957369E-3,2.6897658792005064E-3,-0.71489470128375809]
["C11","ILS",3.237651082252805E-2,-0.23601852360406481,3.925796013945238E-4,-2.8618296278466277E-3,8.2898072586573992]
["C11","KOR",0.97351893779280774,0.57258325835529744,1.1804350340395287E-2,6.9428268093018825E-3,0.41184168470982607]
["C11","MXN",0.19920557722761009,0.39001157957973726,2.4154562711299226E-3,4.7290639590516111E-3,-0.95783464001168173]
["C11","MYR",0.21679865274769075,0.21679865274769075,2.6287801407969178E-3,2.6287801407969178E-3,0]
["C11","PHP",0.13267706648977112,0.135750213387476,1.6087684729914336E-3,1.6460317466882499E-3,-2.3162608120686823E-2]
["C11","PLN",8.539018333566363E-2,-9.9912309968452264E-3,1.0353939719036905E-3,-1.2114812197282477E-4,1.1170067870397971]
["C11","SGD",5.4378000884680602E-2,-7.2573443074353289E-2,6.5935745914550293E-4,-8.7998529273677711E-4,2.3346103551739565]
["C11","THB",0.22781429372586892,0.23378301273856122,2.762349689659771E-3,2.8347230637914959E-3,-2.6199932037076268E-2]
["C11","TRL",6.9115876547151192E-2,0.21382000250760255,8.3806075996409888E-4,2.5926626811250781E-3,-2.0936452402760675]
["C11","ZAR",0.4388364477019065,0.59181043014031598,5.321087212286307E-3,7.1759648233603486E-3,-0.3485899661240579]
["C11","COP",2.4592281454574087E-2,2.610456465995627E-2,2.9819235629618686E-4,3.1652946313326678E-4,-6.1494221598578092E-2]
["C11","INR",0.31894953993599684,0.62008087661936162,3.8674051054913331E-3,7.5187565673757823E-3,-0.94413472658964293]
["C11","AED",2.0361296394253749E-2,2.0361296394253749E-2,2.4688977963523932E-4,2.4688977963523932E-4,0]
["C11","CZK",1.7193108407158672E-4,1.7193108407158672E-4,2.0847409043591791E-6,2.0847409043591791E-6,0]
["C11","HUF",1.4610359750749221E-2,1.4610578293759164E-2,1.7715711364390505E-4,1.7715976357515306E-4,-1.4958085472915883E-5]
["C11","QAR",1.6384729887647172E-2,1.6384729887647172E-2,1.9867214115530237E-4,1.9867214115530237E-4,0]
["C11","RUB",0.11875534548705975,0.11875534548705975,1.4399614106143691E-3,1.4399614106143691E-3,0]
["C11","PKR",2.4210841741379354E-2,2.4210841741379354E-2,2.9356723003156682E-4,2.9356723003156682E-4,0]
["C11","EGP",9.993577035626049E-3,9.993577035626049E-3,1.211765687370385E-4,1.211765687370385E-4,0]
["C11","MAD",1.5939853930755491E-3,1.5939853930755491E-3,1.9327782220648531E-5,1.9327782220648531E-5,0]
["C11","NGN",5.0630171334446576E-3,5.0630171334446576E-3,6.1391335805040522E-5,6.1391335805040522E-5,0]
["C11","PEN",-1.6824410241588601E-7,5.0673017609527979E-3,-2.0400346110628441E-9,6.1443288820252383E-5,30119.748224688625]
["C11","RON",-1.6925815640876145E-7,-1.6925815640876145E-7,-2.0523304669843711E-9,-2.0523304669843711E-9,0]
["C12","CAD",225.67926942474665,304.6251846387957,0.50870517888872679,0.68665770427515183]
["C12","CHF",5.4782160144741576,6.0529206479322557,1.2348484044359374E-2,1.3643929674419642E-2,-0.10490726030876729]
["C12","EUR",18.886026800226819,11.031849552786179,4.2571121691397942E-2,2.4866967243063219E-2,0.41587239764725492]
["C12","GBP",6.8253612385694122,6.7183751601164508,1.5385093272842302E-2,1.5143935224445813E-2,1.5674786244044392E-2]
["C12","JPY",10.348630267766465,8.2547090462625281,2.3326917997547228E-2,1.8606995905105096E-2,0.20233800680134506]
["C12","NOK",0.75365304222311558,0.83017999935416531,1.6988144575325501E-3,1.8713143930223792E-3,-0.10154136299285876]
["C12","NZD",0.6354813540598393,2.5860849739198083E-2,1.43244285007426E-3,5.8293117601481768E-5,0.9593051006548291]
["C12","USD",141.4427690882363,68.676956440657051,0.31882710953006227,0.15480519544719348,0.51445410123571411]
["C12","BRL",1.9054199700764691,2.8005185017968555,4.2950201372355884E-3,6.3126678363907406E-3,-0.46976443292155889]
["C12","CNY",0.46737316862635259,0.46737316862635259,1.0535090438740535E-3,1.0535090438740535E-3,0]
["C12","DKK",0.93067588815628133,0.91703433948573987,2.0978428607056239E-3,2.0670933528998967E-3,1.4657679267447321E-2]
["C12","HKD",9.6998311629955687,9.5515480161732071,2.1864455514853928E-2,2.1530209463266076E-2,1.528718843973853E-2]
["C12","NTD",2.8365950025115767,2.888702739246864,6.3939881224610627E-3,6.5114445268750713E-3,-1.8369818986901487E-2]
["C12","SEK",2.8040674279192395,3.808838522373009,6.3206674949440149E-3,8.5855288650166662E-3,-0.35832629574081265]
["C12","AUD",4.3557646192606816,6.4452381664165959,9.8183587065229158E-3,1.4528255265912688E-2,-0.47970304408013842]
["C12","CLP",1.617162139197394E-2,1.617162139197394E-2,3.6452561965901089E-5,3.6452561965901089E-5,0]
["C12","IDR",0.64915569555004049,1.1744468491384286,1.4632662763982179E-3,2.6473286448026462E-3,-0.80919131910766051]
["C12","ILS",0.13143803254567865,-1.39251287345647,2.9627536472164745E-4,-3.1388727560230749E-3,11.59444398616154]
["C12","KOR",2.7959376892096524,0.51971380664630706,6.3023421955263025E-3,1.1714904326607164E-3,0.81411824424698886]
["C12","MXN",0.6972623736489274,1.7779062923719726,1.571703867278478E-3,4.0075906875002626E-3,-1.5498382812022364]
["C12","MYR",0.92198144035150131,0.92198144035150131,2.0782446466687601E-3,2.0782446466687601E-3,0]
["C12","PHP",0.63051404559568613,0.64817730525584227,1.4212460062201764E-3,1.4610608801697484E-3,-2.8014062150619523E-2]
["C12","PLN",0.23965788055011208,-0.30192192535240836,5.4021446147046678E-4,-6.8056426909889685E-4,2.2598038698305061]
["C12","SGD",0.3264179360458635,-0.47377391729746376,7.357808937079617E-4,-1.0679370150654666E-3,2.4514334691182409]
["C12","THB",0.67138622486657995,0.70569245397454294,1.5133762639995922E-3,1.5907061687792747E-3,-5.1097606470523527E-2]
["C12","TRL",0.20673825430146642,1.0283718460160254,4.6601010764366811E-4,2.3180599849741811E-3,-3.9742697571415597]
["C12","ZAR",1.5325892016639409,2.401141244331618,3.4546197618534817E-3,5.412428839158925E-3,-0.56672201639205411]
["C12","COP",0.18681770283978361,0.19550975790236261,4.211070568640902E-4,4.4069987740445596E-4,-4.6526934709358869E-2]
["C12","INR",0.9948876628297938,2.7047878564385841,2.2425830595077297E-3,6.0968807364225209E-3,-1.718686699506617]
["C12","AED",5.6384744538797833E-2,5.6384744538797833E-2,1.2709723684553492E-4,1.2709723684553492E-4,0]
["C12","CZK",5.1735165626149338E-4,5.1735165626149338E-4,1.1661658933836631E-6,1.1661658933836631E-6,0]
["C12","HUF",3.8211282061297376E-2,3.8213049547575421E-2,8.6132311249091599E-5,8.6136295351953808E-5,-4.6255613072920809E-5]
["C12","QAR",4.2783587128413042E-2,4.2783587128413042E-2,9.6438775254534967E-5,9.6438775254534967E-5,0]
["C12","RUB",0.31110011244441399,0.31110011244441399,7.012528831590811E-4,7.012528831590811E-4,0]
["C12","PKR",7.9171092555954573E-2,7.9171092555954573E-2,1.7846009916707277E-4,1.7846009916707277E-4,0]
["C12","EGP",3.3864246946637089E-2,3.3864246946637089E-2,7.6333629778367398E-5,7.6333629778367398E-5,0]
["C12","MAD",5.4013807856799351E-3,5.4013807856799351E-3,1.217528923161316E-5,1.217528923161316E-5,0]
["C12","NGN",1.7156545838472505E-2,1.7156545838472505E-2,3.867268687159166E-5,3.867268687159166E-5,0]
["C12","PEN",-1.3606893327853319E-6,2.9122229264683736E-2,-3.0671390961647766E-9,6.5644615411471956E-5,21403.555721569828]
["C12","RON",-1.368890585793079E-6,-1.368890585793079E-6,-3.0856255964492388E-9,-3.0856255964492388E-9,0]
["C13","CAD",325.44539377849975,409.90296381903295,0.67668718577836817,0.85229684712544318]
["C13","AUD",2.8119072540772398,4.8461656610572534,5.8467000695248796E-3,1.0076462182864806E-2,-0.72344434690381676]
["C13","CHF",3.077217888629074,2.0490994240687379,6.3983511608724638E-3,4.2606205193270541E-3,0.33410648896831008]
["C13","EUR",12.587770245958508,-5.3821111231733054,2.6173308904656779E-2,-1.1190834773238083E-2,1.4275666792457793]
["C13","GBP",4.4490044812891822,-2.6850259918681885,9.2506588801436491E-3,-5.5828803139111732E-3,1.6035116402243208]
["C13","JPY",6.5014407837742745,1.1468109137466134,1.3518217653654088E-2,2.3845236856272337E-3,0.82360665091209884]
["C13","USD",105.99323815715736,49.876174126113511,0.22038802026775395,0.10370577845622381,0.52944003793749994]
["C13","BRL",1.3716749903208407,2.3071915859677627,2.8520756684438297E-3,4.7972624938199312E-3,-0.6820249711107591]
["C13","CNY",0.31728602119583821,0.31728602119583821,6.5972168872039999E-4,6.5972168872039999E-4,0]
["C13","DKK",0.50510118224367262,0.48474236095889456,1.0502391617145631E-3,1.0079077791099052E-3,4.030642176354382E-2]
["C13","HKD",5.4861051876554301,5.3329670950447818,1.1407065981844338E-2,1.1088651320259987E-2,2.791380904530083E-2]
["C13","NOK",0.60914878181867682,0.68908376556687145,1.266581683960627E-3,1.432787690350197E-3,-0.13122407223657317]
["C13","NTD",2.0229219128779019,2.0760406434007432,4.2061905390076374E-3,4.3166384511820685E-3,-2.6258418668900552E-2]
["C13","SEK",1.5967257884697981,2.6424489707926724,3.3200158948777686E-3,5.4943514082292991E-3,-0.65491719985623198]
["C13","NZD",0.67745488701809953,-8.1994413120042145E-2,1.4086081712991986E-3,-1.7048810560678387E-4,1.1210330232924448]
["C13","CLP",1.4024844243370114E-2,1.4024844243370114E-2,2.9161366433366449E-5,2.9161366433366449E-5,0]
["C13","IDR",0.57682381257537452,1.1262085049113191,1.199369509857742E-3,2.3416858199774922E-3,-0.95243067355884437]
["C13","ILS",8.9743806650771418E-2,-1.5095492458344255,1.8660114761028299E-4,-3.1387527692365801E-3,17.820650941503715]
["C13","KOR",1.7395279541581288,-0.64941563725951235,3.6169394263518731E-3,-1.3503071433135672E-3,1.3733286583335231]
["C13","MXN",0.45844955525256992,1.5847285214630729,9.532380709506938E-4,3.29507039863474E-3,-2.4567129650502357]
["C13","MYR",0.65647738314186177,0.65647738314186177,1.3649903836947825E-3,1.3649903836947825E-3,0]
["C13","PHP",0.56048196080001489,0.57848743387215151,1.1653904709784831E-3,1.2028286192353453E-3,-3.2124982303509242E-2]
["C13","PLN",0.14187835195639842,-0.4239618641429963,2.9500267800253838E-4,-8.815290251719891E-4,3.9882068567675981]
["C13","SGD",0.31305638071925063,-0.52863588359433478,6.5092714571665319E-4,-1.099174040282711E-3,2.6886283626603866]
["C13","THB",0.4642039317112216,0.49917567952567105,9.6520294397134106E-4,1.0379184718685252E-3,-7.5337034922412505E-2]
["C13","TRL",0.14922396428208426,1.0101412018177454,3.1027615191709111E-4,2.1003511500367312E-3,-5.7692961159256795]
["C13","ZAR",0.97059858660744647,1.8787649866015061,2.0181315779779366E-3,3.9064501013880886E-3,-0.93567661495200882]
["C13","COP",0.19080331725789762,0.19966386598671637,3.9673064133241294E-4,4.1515406934331071E-4,-4.6438127261920092E-2]
["C13","INR",0.79717151602517,2.5872001951276893,1.6575307565388098E-3,5.3794745679447411E-3,-2.2454749613080764]
["C13","AED",3.384979046345607E-2,3.384979046345607E-2,7.0382681352354045E-5,7.0382681352354045E-5,0]
["C13","CZK",3.4500527309576546E-4,3.4500527309576546E-4,7.1735735638884392E-7,7.1735735638884392E-7,0]
["C13","HUF",1.5573004098719171E-2,1.5576094669369638E-2,3.2380400887927562E-5,3.2386827003017511E-5,-1.9845693424813682E-4]
["C13","QAR",1.7301073921154524E-2,1.7301073921154524E-2,3.5973515823111373E-5,3.5973515823111373E-5,0]
["C13","RUB",0.17952782009371326,0.17952782009371326,3.7328589579246869E-4,3.7328589579246869E-4,0]
["C13","PKR",6.7565134928880458E-2,6.7565134928880458E-2,1.4048581385938275E-4,1.4048581385938275E-4,0]
["C13","EGP",3.0026785262318358E-2,3.0026785262318358E-2,6.2433640805986199E-5,6.2433640805986199E-5,0]
["C13","MAD",4.7893018624390179E-3,4.7893018624390179E-3,9.9582272820327771E-6,9.9582272820327771E-6,0]
["C13","NGN",1.5212383684382904E-2,1.5212383684382904E-2,3.1630575516370685E-5,3.1630575516370685E-5,0]
["C13","PEN",-2.3792583674044964E-6,2.9679745268797315E-2,-4.9471084232778205E-9,6.1712052726825586E-5,12475.368347467274]
["C13","RON",-2.393598819241464E-6,-2.393598819241464E-6,-4.9769260215043063E-9,-4.9769260215043063E-9,0]
["C14","CAD",361.98459159271965,464.21040750773165,0.6822457614011882,0.8749145413261229]
["C14","USD",117.80754814596381,41.03590437019708,0.22203624753752288,7.7341888224157579E-2,0.65166999045465657]
["C14","CHF",2.829111473664276,1.8291578850801371,5.3321311355998095E-3,3.4474815862703262E-3,0.35345146272691585]
["C14","EUR",13.141236724274462,-2.9517027491364072,2.4767775377558931E-2,-5.563183451135191E-3,1.224613771981143]
["C14","GBP",4.6432831976580715,-1.3118375888923279,8.7513677492434133E-3,-2.4724688714804007E-3,1.2825237085590597]
["C14","JPY",5.8756394738502049,1.1825921291423311,1.1074035248069472E-2,2.2288751684810359E-3,0.79872963029717703]
["C14","BRL",1.5023181562219541,2.3366158318606227,2.8314746488206336E-3,4.4039063660020255E-3,-0.55534020685523067]
["C14","CNY",0.21701207429030972,0.21701207429030972,4.090106907755499E-4,4.090106907755499E-4,0]
["C14","DKK",0.33561208368514528,0.32171074826569246,6.3254051936783141E-4,6.0634015783860701E-4,4.142084297684101E-2]
["C14","HKD",6.7283343761887071,6.5937639535261106,1.2681140899526003E-2,1.2427511041781058E-2,2.0000555135730957E-2]
["C14","NOK",0.76560068226534339,0.8353084962941113,1.4429559504264093E-3,1.5743368482939574E-3,-9.1049832691513233E-2]
["C14","NTD",1.4502807398639939,1.5001983251785607,2.7333978036480854E-3,2.8274793247714015E-3,-3.4419256866948356E-2]
["C14","SEK",1.3800915184361846,2.3160123489818134,2.6011095794325899E-3,4.365074219024938E-3,-0.67815852647666697]
["C14","MXN",0.52313034944036141,1.5184874098884182,9.8596313725853968E-4,2.8619494398343282E-3,-1.9026941593292723]
["C14","NZD",0.88332325831251435,5.3932736712647693E-2,1.6648320479034455E-3,1.0164902561479687E-4,0.93894337525349458]
["C14","AUD",3.244143955777437,4.797226615336025,6.1143582202379991E-3,9.0415106079332827E-3,-0.4787341994465848]
["C14","CLP",8.5442227338926088E-3,8.5442227338926088E-3,1.6103612916277358E-5,1.6103612916277358E-5,0]
["C14","IDR",0.82594455620622509,1.3164019529516549,1.556688283732505E-3,2.4810714974078359E-3,-0.59381394678382082]
["C14","ILS",4.6324716530474958E-2,-1.3777311020475176,8.7309908308439015E-5,-2.5966608152760153E-3,30.740734649529262]
["C14","KOR",1.6426810773005862,-0.48342531273974376,3.0960218427838813E-3,-9.1112958460347728E-4,1.2942904252200649]
["C14","MYR",0.89866756670030734,0.89866756670030734,1.6937520340087741E-3,1.6937520340087741E-3,0]
["C14","PHP",0.74471428891401703,0.76163416809859363,1.4035905916076751E-3,1.4354801143254972E-3,-2.271996044180935E-2]
["C14","PLN",0.16940946820779654,-0.33511339175441079,3.1929229671753546E-4,-6.3160061622308272E-4,2.9781266968110831]
["C14","SGD",0.39394940313794458,-0.47304433198237045,7.4249102514228741E-4,-8.9156416583870883E-4,2.2007743334915784]
["C14","THB",0.37002046188369381,0.40288457878437983,6.9739126364774611E-4,7.5933148148694409E-4,-8.8817025775769221E-2]
["C14","TRL",0.11536545561726691,0.88231349458947461,2.1743354533596739E-4,1.6629289088305106E-3,-6.6479869114079717]
["C14","ZAR",1.0384225951251518,1.8478429429520402,1.9571535101816353E-3,3.4826980066117331E-3,-0.77947104736230854]
["C14","COP",0.28547722575835538,0.29380364594630382,5.3804949650825213E-4,5.5374260890256257E-4,-2.9166670531527439E-2]
["C14","INR",0.39345595415773316,1.9887789615391909,7.415610035804974E-4,3.7483253386668704E-3,-4.0546419250321124]
["C14","AED",3.3515643420151779E-2,3.3515643420151779E-2,6.3168173991669043E-5,6.3168173991669043E-5,0]
["C14","CZK",6.107403037279031E-4,6.107403037279031E-4,1.1510848616563505E-6,1.1510848616563505E-6,0]
["C14","HUF",3.3866617500380281E-2,3.3870873210258744E-2,6.382966783466386E-5,6.3837688728629431E-5,-1.2566090718735268E-4]
["C14","QAR",3.7765457039382375E-2,3.7765457039382375E-2,7.1177955059166368E-5,7.1177955059166368E-5,0]
["C14","RUB",0.1811323633836989,0.1811323633836989,3.4138687126812438E-4,3.4138687126812438E-4,0]
["C14","PKR",2.7718959035146051E-2,2.7718959035146051E-2,5.2242948322670844E-5,5.2242948322670844E-5,0]
["C14","EGP",1.1316921854625605E-2,1.1316921854625605E-2,2.1329421601773172E-5,2.1329421601773172E-5,0]
["C14","MAD",1.8050601968187673E-3,1.8050601968187673E-3,3.4020637810440074E-6,3.4020637810440074E-6,0]
["C14","NGN",5.7334595053966384E-3,5.7334595053966384E-3,1.080606339764679E-5,1.080606339764679E-5,0]
["C14","PEN",-3.2762342242676566E-6,2.7883248080361158E-2,-6.1748399373280771E-9,5.2552589968602462E-5,8511.7614937372055]
["C14","RON",-3.2959809990372196E-6,-3.2959809990372196E-6,-6.21205741481407E-9,-6.21205741481407E-9,0]
["C17","AUD",0.68118622240948723,0.68118622240948723,2.1962909351497074E-2,2.1962909351497074E-2,0]
["C17","CAD",1.3295258733732722,1.3295258733732722,4.2866774571687916E-2,4.2866774571687916E-2]
["C17","DKK",0.74880816328253008,0.74880816328253008,2.4143186210758241E-2,2.4143186210758241E-2,0]
["C17","EUR",3.2162286398010185,3.2162286398010185,0.1036981309160646,0.1036981309160646,0]
["C17","GBP",2.3121513049209015,2.3121513049209015,7.4548732558476022E-2,7.4548732558476022E-2,0]
["C17","HKD",0.95165511833462901,0.95165511833462901,3.0683408457587998E-2,3.0683408457587998E-2,0]
["C17","JPY",2.3317480077057171,2.3317480077057171,7.5180572417668609E-2,7.5180572417668609E-2,0]
["C17","KOR",0.884131,0.884131,2.8506285607426012E-2,2.8506285607426012E-2,0]
["C17","NOK",0.31913599999999998,0.31913599999999998,1.0289631246513817E-2,1.0289631246513817E-2,0]
["C17","NTD",0.80412499999999998,0.80412499999999998,2.5926720038174707E-2,2.5926720038174707E-2,0]
["C17","SEK",0.67039835218646116,0.67039835218646116,2.1615085205897128E-2,2.1615085205897128E-2,0]
["C17","SGD",0.122513,0.122513,3.9500827011184798E-3,3.9500827011184798E-3,0]
["C17","USD",16.639651629738573,16.639651629738573,0.53649816799252537,0.53649816799252537,0]
["C17","CHF",3.9217880393114671E-3,3.9217880393114671E-3,1.2644688393507293E-4,1.2644688393507293E-4,0]
["C19","BRL",9.7476999999999994E-2,9.7476999999999994E-2,1.696662912240595E-4,1.696662912240595E-4,0]
["C19","CAD",1.0684,97.863600000000005,1.8596332011016465E-3,0.1703391985579662]
["C19","EUR",46.610163999999997,46.610163999999997,8.1128611459371697E-2,8.1128611459371697E-2,0]
["C19","HKD",7.9148719999999999,7.9148719999999999,1.3776449600963862E-2,1.3776449600963862E-2,0]
["C19","USD",518.83101652999994,422.03578569999996,0.90306569084659771,0.73458607182772317,0.18656407914348938]
["C24","CAD",8.1608999999999998,16.797999999999998,3.7076714438560983E-2,7.6316907343423807E-2]
["C24","CHF",12.975336,12.975336,5.8949727066424061E-2,5.8949727066424061E-2,0]
["C24","EUR",17.930229000000001,17.930229000000001,8.1460865891140058E-2,8.1460865891140058E-2,0]
["C24","GBP",12.872584,12.872584,5.8482902750234544E-2,5.8482902750234544E-2,0]
["C24","HKD",15.289508,15.289508,6.9463505498424644E-2,6.9463505498424644E-2,0]
["C24","JPY",23.177605220000004,23.177605220000004,0.10530081855085108,0.10530081855085108,0]
["C24","KOR",5.9242020000000002,5.9242020000000002,2.6914916961407669E-2,2.6914916961407669E-2,0]
["C24","USD",123.77815054999999,115.14107865000001,0.56235061594622648,0.5231105507056748,6.9778647213758815E-2]
["C30","AUD",4.5140462999999995,2.3222875099999989,0.15029136715797742,7.7318605440931137E-2,0.4855419382827334]
["C30","CAD",0.17050000000000001,11.251300000000001,5.6766538040239319E-3,0.37460255099832535]
["C30","CHF",0.648003,0.28722331999999995,2.15747137534834E-2,9.5628583699846493E-3,0.55675618785715508]
["C30","EUR",5.1014650000000001,3.7287286399999995,0.16984897770290291,0.12414487752744269,0.26908669568447507]
["C30","GBP",7.7529310000000002,5.2261731200000003,0.25812730353950186,0.17400102945534091,0.32591001777263329]
["C30","HKD",4.0501449999999997,2.7977491299999997,0.13484616434661881,9.3148699363748644E-2,0.30922247721995144]
["C30","JPY",5.7338833899999999,3.1449586099999998,0.19090481500101547,0.10470874637509862,0.4515133294330913]
["C30","KOR",0.67475099999999999,0.55547234999999995,2.2465265870492388E-2,1.8493983745792451E-2,0.17677432119404057]
["C30","NTD",0.70227399999999995,0.37379666000000006,2.3381620959337844E-2,1.2445244761996719E-2,0.46773387595155158]
["C30","SEK",0.68725700000000001,0.34764517000000006,2.2881642600540032E-2,1.1574552942704087E-2,0.49415550514581874]
["C35","AED",3.1322909999999999,3.1322909999999999,1.0828964581650828E-2,1.0828964581650828E-2,0]
["C35","BRL",19.6877225,19.6877225,6.8064445367901669E-2,6.8064445367901669E-2,0]
["C35","CAD",1.6076999999999999,1.6076999999999999,5.5581446161675381E-3,5.5581446161675381E-3]
["C35","CLP",0.203517,0.203517,7.035995010565211E-4,7.035995010565211E-4,0]
["C35","CNY",9.7668213900000005,9.7668213900000005,3.3765880279839809E-2,3.3765880279839809E-2,0]
["C35","COP",-4.4651999999999997E-2,-4.4651999999999997E-2,-1.5437101038820236E-4,-1.5437101038820236E-4,0]
["C35","HKD",67.991810689999994,67.991810689999994,0.23506146453324997,0.23506146453324997,0]
["C35","IDR",0.84015700000000004,0.84015700000000004,2.9045929627949689E-3,2.9045929627949689E-3,0]
["C35","INR",18.442731239999997,18.442731239999997,6.3760258349835702E-2,6.3760258349835702E-2,0]
["C35","KOR",41.172673700000004,41.172673700000004,0.14234227446593137,0.14234227446593137,0]
["C35","MXN",7.0881784100000003,7.0881784100000003,2.4505268811330774E-2,2.4505268811330774E-2,0]
["C35","MYR",3.8907219999999998,3.8907219999999998,1.3451014204954032E-2,1.3451014204954032E-2,0]
["C35","NGN",0.90268899999999996,0.90268899999999996,3.1207787556283258E-3,3.1207787556283258E-3,0]
["C35","NTD",45.062775129999999,45.062775129999999,0.15579114323466939,0.15579114323466939,0]
["C35","PHP",5.3706680000000002,5.3706680000000002,1.8567487360467302E-2,1.8567487360467302E-2,0]
["C35","RUB",11.621718660000001,11.621718660000001,4.0178635939971903E-2,4.0178635939971903E-2,0]
["C35","THB",9.1801877300000001,9.1801877300000001,3.1737768866646018E-2,3.1737768866646018E-2,0]
["C35","TRL",2.5691109999999999,2.5691109999999999,8.8819372227323511E-3,8.8819372227323511E-3,0]
["C35","USD",28.8742199,28.8742199,9.982402804206171E-2,9.982402804206171E-2,0]
["C35","ZAR",11.890166050000001,11.890166050000001,4.1106712953999848E-2,4.1106712953999848E-2,0]
["C36","CAD",70.564678250544361,75.107311658429509,0.29560318678379571,0.31463277701296993]
["C36","CHF",6.4021169644565834,7.9797237008284361,2.6819171060860993E-2,3.342793893630306E-2,-0.24641954296218649]
["C36","EUR",17.822809041544492,24.708389409054476,7.466170442120533E-2,0.10350615677263639,-0.38633530502738833]
["C36","GBP",7.0939244291379406,14.429064406249418,2.9717228506464806E-2,6.0444935434295147E-2,-1.0340031177922837]
["C36","JPY",10.120564963673578,13.449557235041423,4.2396158098988571E-2,5.634167232213845E-2,-0.32893344228477561]
["C36","USD",95.811759116367185,70.049649983902881,0.40136598122929923,0.29344567681312161,0.26888253978486298]
["C36","BRL",1.3383761568598498,1.8148095764090626,5.606604704956177E-3,7.6024366225765482E-3,-0.3559787112967101]
["C36","CNY",0.53678975651065453,0.53678975651065453,2.2486712416381368E-3,2.2486712416381368E-3,0]
["C36","DKK",1.0675779554035587,1.0627907071199367,4.4722012993092105E-3,4.4521469905013473E-3,4.4842142528246365E-3]
["C36","HKD",8.1779246891112631,8.0910869366529816,3.425822464315597E-2,3.3894451761365608E-2,1.0618556144678659E-2]
["C36","NOK",0.46843981844927796,0.50927533997726537,1.9623458447351602E-3,2.1334103290766336E-3,-8.7173463740057855E-2]
["C36","NTD",3.068919957812851,3.0993285256604652,1.285604273986571E-2,1.2983427570125553E-2,-9.9085568426768855E-3]
["C36","SEK",3.2498287357415543,3.784878852187556,1.3613889478470717E-2,1.5855273176826331E-2,-0.16463948101680881]
["C36","NZD",0.31842939816179622,8.9026793314769453E-2,1.3339357196253772E-3,3.7294301434422187E-4,0.72041905104021109]
["C36","AUD",3.9811724272494358,5.2316415261373743,1.6677568520219725E-2,2.1915920905155095E-2,-0.31409568958355294]
["C36","CLP",1.9785468342355606E-2,1.9785468342355606E-2,8.2883499776534474E-5,8.2883499776534474E-5,0]
["C36","IDR",0.16782596693900956,0.4471648155554267,7.0304140658163431E-4,1.8732225211379411E-3,-1.6644554696230829]
["C36","ILS",0.15694950694675167,-0.64525795890628945,6.5747872119359331E-4,-2.7030564537270487E-3,5.1112455302277979]
["C36","KOR",2.347905157917928,1.1503606623681604,9.8356325594285039E-3,4.8189871501911506E-3,0.51004807051564405]
["C36","MXN",0.60988365101877495,1.1853710808881661,2.5548695930898745E-3,4.9656496383045758E-3,-0.94360199508229647]
["C36","MYR",0.61218821147416569,0.61218821147416569,2.5645236499301912E-3,2.5645236499301912E-3,0]
["C36","PHP",0.24726634337271136,0.25757450131217391,1.0358258678064035E-3,1.0790078734829094E-3,-4.1688479713249071E-2]
["C36","PLN",0.13967470540379542,-0.148793794252638,5.851126803675501E-4,-6.2331354503685995E-4,2.0652880478428761]
["C36","SGD",0.14051622865551733,-0.20061116177317598,5.8863791368723485E-4,-8.4038218829535899E-4,2.4276725449626495]
["C36","THB",0.66375171180488624,0.68377190695096557,2.7805288156502054E-3,2.8643956117858325E-3,-3.0162174786171336E-2]
["C36","TRL",0.20463546143836076,0.63894068725127362,8.5724042155163268E-4,2.6765927089853624E-3,-2.1223360934621396]
["C36","ZAR",1.4431993938255356,1.9048209563711942,6.0457207565596666E-3,7.9795041785163771E-3,-0.31985986449316828]
["C36","COP",1.9405229765911459E-2,2.4477781071143335E-2,8.1290638621043311E-5,1.0254011311913299E-4,-0.26140124937570497]
["C36","INR",1.4017334118998035,2.3078430655607525,5.8720152043732774E-3,9.6678080548235189E-3,-0.64642081437787557]
["C36","AED",4.589398893205774E-2,4.589398893205774E-2,1.922549598308678E-4,1.922549598308678E-4,0]
["C36","CZK",4.1093374536734988E-5,4.1093374536734988E-5,1.7214465891318986E-7,1.7214465891318986E-7,0]
["C36","HUF",3.7518199136649575E-3,3.7518220225850893E-3,1.5716785652738535E-5,1.5716794487236575E-5,-5.6210590604344191E-7]
["C36","QAR",4.2105483077045343E-3,4.2105483077045343E-3,1.7638449274088153E-5,1.7638449274088153E-5,0]
["C36","RUB",0.24745909313297385,0.24745909313297385,1.0366333177204115E-3,1.0366333177204115E-3,0]
["C36","PKR",0.12310333422120188,0.12310333422120188,5.1569338657357579E-4,5.1569338657357579E-4,0]
["C36","EGP",5.517051896613992E-2,5.517051896613992E-2,2.3111536291573739E-4,2.3111536291573739E-4,0]
["C36","MAD",8.7997521855211775E-3,8.7997521855211775E-3,3.6863128316292781E-5,3.6863128316292781E-5,0]
["C36","NGN",2.7950881029967584E-2,2.7950881029967584E-2,1.1708931027131014E-4,1.1708931027131014E-4,0]
["C36","PEN",-1.6235402573524235E-9,1.7000891318408425E-2,-6.8011884393656662E-12,7.1218600813895551E-5,10471494.540993253]
["C36","RON",-1.6333257859797066E-9,-1.6333257859797066E-9,-6.8421810934569735E-12,-6.8421810934569735E-12,0]
["C42","AUD",36.942247000000002,36.942247000000002,0.1287455012387603,0.1287455012387603,0]
["C42","CAD",174.18440000000001,174.18440000000001,0.60704098172406018,0.60704098172406018]
["C42","EUR",2.1713209999999998,2.1713209999999998,7.5671577447697265E-3,7.5671577447697265E-3,0]
["C42","GBP",6.3405300000000002,6.3405300000000002,2.2097050917595694E-2,2.2097050917595694E-2,0]
["C42","USD",66.69256,66.69256,0.23242676781669763,0.23242676781669763,0]
["C42","ZAR",0.60901400000000006,0.60901400000000006,2.1224429767745952E-3,2.1224429767745952E-3,0]
["C44","CAD",12.037322219330537,12.396066144990904,0.45999106636696413,0.47370001241911697]
["C44","EUR",0.27200200000000002,0.27200200000000002,1.0394212911657484E-2,1.0394212911657484E-2,0]
["C44","GBP",0.24001600000000001,0.24001600000000001,9.1719083176020118E-3,9.1719083176020118E-3,0]
["C44","USD",13.6192350233494,13.260495945627316,0.52044186633405687,0.50673310553974293,2.6340618772423441E-2]
["C50","CAD",26.206775588303188,26.206775588303188,0.99999143695589676,0.99999143695589676]
["C50","USD",2.2826266799873778E-4,2.2826266799873778E-4,8.7099884763131131E-6,8.7099884763131131E-6,0]
["C513","CAD",77.288904226852381,89.087758747168749,0.56167629012857456,0.64742128678794764]
["C513","EUR",14.903859552781615,14.903859552781615,0.10830978425613801,0.10830978425613801,0]
["C513","HKD",4.5276301970140276,4.5276301970140276,3.2903332730255135E-2,3.2903332730255135E-2,0]
["C513","USD",40.88364613457491,29.084792791248482,0.29711088438253908,0.21136589627662336,0.28859591692210274]
["C515","CAD",211.64319957178236,267.46219070571323,0.63270090976071491,0.79957008648748751]
["C515","EUR",24.499372002027684,7.8677199730541529,7.3240127656413342E-2,2.3520309628496081E-2,0.67886034089351421]
["C515","HKD",7.2942136121579244,7.2942136121579244,2.1805829800999751E-2,2.1805829800999751E-2,0]
["C515","NZD",0.44614641674963063,-8.0631386102429353E-3,1.3337411470583788E-3,-2.4104507702347287E-5,1.0180728530086298]
["C515","USD",90.405493007375043,51.777450960590706,0.27026447241803259,0.15478711526823974,0.42727538738860882]
["C515","AUD",8.6107086148652142E-3,3.1543844666389723E-3,2.5741451581400159E-5,9.4299364487761035E-6,0.63366726157782671]
["C515","BRL",1.3074233439266333E-2,1.3840065531406386E-2,3.9085023323143224E-5,4.1374455076213197E-5,-5.8575678313957713E-2]
["C515","CHF",5.568197909150437E-4,3.5870676822517681E-6,1.6645958339201473E-6,1.0723429765406659E-8,0.99355793788084112]
["C515","CLP",8.400134719827037E-4,8.400134719827037E-4,2.5111947325028696E-6,2.5111947325028696E-6,0]
["C515","COP",4.3448458491838473E-4,1.5407909464914358E-3,1.2988784553960216E-6,4.6061476842565142E-6,-2.5462499705964574]
["C515","GBP",4.1207203556456656E-2,6.6156802314352881E-3,1.2318768205931603E-4,1.9777374891251432E-5,0.83945330766327397]
["C515","IDR",1.0253227000237455E-3,3.3401718440816161E-3,3.0651710351000964E-6,9.9853421644705005E-6,-2.2576786254749464]
["C515","INR",0,7.1228875070021905E-4,0,2.1293655619088331E-6]
["C515","JPY",1.8155705773733245E-2,3.1137131537911796E-3,5.42759303565189E-5,9.3083507956957004E-6,0.82849947049175354]
["C515","KOR",0,3.1304122713409254E-3,0,9.3582722998465665E-6]
["C515","MXN",7.1133154279954897E-2,1.5007341869858E-3,2.1265040179952585E-4,4.4863992197059856E-6,0.97890246535280245]
["C515","NOK",3.3671583056381609E-3,-6.6864599817999281E-4,1.00660173707261E-5,-1.9988968802791949E-6,1.198578723507111]
["C515","NTD",0,6.689336521825919E-3,0,1.9997568131733724E-5]
["C515","PEN",-4.7671992324514902E-6,3.6952221295428567E-3,-1.425139715089046E-8,1.1046754196969744E-5,776.13482222194045]
["C515","PHP",5.5456138629127768E-4,2.8168423574741704E-3,1.6578444019679012E-6,8.4208645769502045E-6,-4.0794058639969082]
["C515","RUB",4.1138778952974034E-2,4.1138778952974034E-2,1.2298312878776719E-4,1.2298312878776719E-4,0]
["C515","SEK",6.4245010020013192E-3,5.9783138052780351E-3,1.9205850397977084E-5,1.787198734042745E-5,6.9450871995239916E-2]
["C515","THB",1.0349153055069591E-3,5.4401861558192382E-3,3.0938478375132369E-6,1.6263271095025487E-5,-4.2566486618480655]
["C515","ZAR",8.7221537161145998E-3,8.3000831730570841E-3,2.6074613322913837E-5,2.4812846268191546E-5,4.8390633414052364E-2]
["C515","CZK",3.5394177117984072E-4,3.5394177117984072E-4,1.0580981627611959E-6,1.0580981627611959E-6,0]
["C515","HUF",3.1513116792785735E-4,3.2132358747950833E-4,9.4207504443953381E-7,9.6058709439850628E-7,-1.9650292265183333E-2]
["C515","MYR",1.0241567823440036E-3,1.0241567823440036E-3,3.0616855596481501E-6,3.0616855596481501E-6,0]
["C515","PLN",8.1945691745498892E-4,8.1945691745498892E-4,2.449741537798073E-6,2.449741537798073E-6,0]
["C515","RON",-4.7959324679532638E-6,-4.7959324679532638E-6,-1.4337294284741789E-8,-1.4337294284741789E-8,0]
["C515","TRL",3.2449948977265474E-4,3.2449948977265474E-4,9.7008135773534156E-7,9.7008135773534156E-7,0]
["C516","CAD",5.3434530470098158,5.9354563488327985,0.75164622971020056,0.83492141635009121]
["C516","AUD",0.18112278903893303,0.18112278903893303,2.5477955976780563E-2,2.5477955976780563E-2,0]
["C516","EUR",0.15518719743438,2.322723171391404E-2,2.1829680325556336E-2,3.267299439290201E-3,0.85032765525818887]
["C516","GBP",0.15174751291575386,7.762217638025555E-2,2.1345831047370076E-2,1.0918860090062673E-2,0.48847809833068367]
["C516","JPY",0.13450923077401394,7.0174728946116594E-2,1.8920977742863124E-2,9.871251785921591E-3,0.47829060844147087]
["C516","NZD",8.8356800873586622E-3,4.7046012345475567E-6,1.2428864942127813E-3,6.6178101484703285E-7,0.99946754509126257]
["C516","SEK",8.1641054182282319E-2,8.1641054182282319E-2,1.1484182611096121E-2,1.1484182611096121E-2,0]
["C516","USD",1.0524620082805993,0.73970964733765499,0.14804642119575176,0.10405255976053664,0.29716261345517447]
["C517","CAD",10.119798076864758,45.224448055487841,0.10136228903918008,0.45297875912341745]
["C517","AUD",5.7004329171855446,5.8028934474540952,5.7096883219554341E-2,5.8123152104101704E-2,-1.7974166481225406E-2]
["C517","BRL",0.2822741932877843,0.31953863578327163,2.8273250267461985E-3,3.2005744890795142E-3,-0.13201505267431757]
["C517","CHF",1.2846082866597977E-6,-1.7142748510490649E-2,1.2866940176624286E-8,-1.7170582023951473E-4,13345.7282634808]
["C517","CLP",4.2073936719038606E-2,4.2073936719038606E-2,4.2142249305162271E-4,4.2142249305162271E-4,0]
["C517","COP",1.5634873585982721E-2,7.0825604281783583E-2,1.5660258865603864E-4,7.0940598992750832E-4,-3.529976139063991]
["C517","EUR",6.7072284116176393,6.136731732791616,6.7181184816764369E-2,6.1466955262396504E-2,8.5056992816565202E-2]
["C517","GBP",4.4054476668973441,2.4513188214446382,4.412600492295355E-2,2.455298860898154E-2,0.4435710041765073]
["C517","HKD",3.5615098911977925,3.5615098911977925,3.567292472295383E-2,3.567292472295383E-2,0]
["C517","IDR",3.6896109450513727E-2,0.15155795057329455,3.6956015151073615E-4,1.5180402489765365E-3,-3.1076946277105186]
["C517","INR",0,3.5376565968576822E-2,0,3.5434004489854877E-4]
["C517","JPY",7.2953540342083647,7.0331082475687765,7.3071990037935144E-2,7.0445274265271765E-2,3.5946958216133362E-2]
["C517","KOR",1.1046872181880203,1.2595498226370008,1.1064808236030808E-2,1.2615948679178956E-2,-0.14018683469787607]
["C517","MXN",0.70927103877739783,3.4758673053014882E-3,7.1042263386689609E-3,3.4815108343639925E-5,0.99509938075112581]
["C517","NOK",0.19574005702412392,-2.085348807646803E-2,1.9605786682624928E-3,-2.0887346465087937E-4,1.1065366404480916]
["C517","NTD",1.2621795469538861,1.5933366654865191,1.2642288619390894E-2,1.5959236577357087E-2,-0.26236926381182424]
["C517","NZD",0.19872450655998228,-0.12258392165831961,1.9904716200959986E-3,-1.2278295282484868E-3,1.6168535717124517]
["C517","PEN",-1.715470696677853E-4,0.18372616006396308,-1.7182559896370546E-6,1.8402446371965264E-3,1071.9956189852942]
["C517","PHP",1.995582230370764E-2,0.13199954091182295,1.9988223213536783E-4,1.3221385957819921E-3,-5.614587908376917]
["C517","RUB",0.48463934685630106,0.48463934685630106,4.8542622276340052E-3,4.8542622276340052E-3,0]
["C517","SEK",1.4500578096973762,1.4360634334267988,1.4524121698246619E-2,1.4383950718382485E-2,9.6509092099562599E-3]
["C517","THB",3.724129816214182E-2,0.25524033609437863,3.7301764322107955E-4,2.5565475244809701E-3,-5.853690625474675]
["C517","USD",55.910198661293975,23.543278645940312,0.5600097624378515,0.23581504264352829,0.57890905041195873]
["C517","ZAR",0.19683694574287411,0.17567543770571228,1.9715653648852199E-3,1.7596066995170399E-3,0.10750780529182191]
["C517","CZK",1.2736550481382738E-2,1.2736550481382738E-2,1.2757229951133525E-4,1.2757229951133525E-4,0]
["C517","HUF",1.1339955765014441E-2,1.1562789210071223E-2,1.1358367679022136E-4,1.158156292357033E-4,-1.9650292265183111E-2]
["C517","MYR",3.6854154048257384E-2,3.6854154048257384E-2,3.6913991628687487E-4,3.6913991628687487E-4,0]
["C517","PLN",2.9488054946700825E-2,2.9488054946700825E-2,2.9535932693597143E-4,2.9535932693597143E-4,0]
["C517","RON",-1.7258103156282215E-4,-1.7258103156282215E-4,-1.7286123963226604E-6,-1.7286123963226604E-6,0]
["C517","TRL",1.1677073657893703E-2,1.1677073657893703E-2,1.1696032927268806E-4,1.1696032927268806E-4,0]
["C51","CAD",86.820393374231301,146.81185621091848,0.43878046356390665,0.74197054195822199]
["C51","USD",89.26758841969172,30.300484901125905,0.45114831096411345,0.15313522888360093,0.66056566064417321]
["C51","BRL",0.40647917806167128,0.40780644950458861,2.0542998625932571E-3,2.0610077425781831E-3,-3.2652876569139178E-3]
["C51","CHF",2.9716236566972727,2.97097435257318,1.5018250378143317E-2,1.5014968868425486E-2,2.1850146556390282E-4]
["C51","CNY",0.49588505080629475,0.49588505080629475,2.5061470469192504E-3,2.5061470469192504E-3,0]
["C51","DKK",0.79038829646745212,0.79038829646745212,3.9945331925023168E-3,3.9945331925023168E-3,0]
["C51","EUR",9.5067587387640078,8.9661254193853477,4.8046085075942276E-2,4.5313785333040278E-2,5.6868311717453879E-2]
["C51","GBP",1.85726013305505,1.6303088207889769,9.3863829737326748E-3,8.2393966709488776E-3,0.1221968362034217]
["C51","HKD",1.3649464063268251,1.3649464063268251,6.8982849953975519E-3,6.8982849953975519E-3,0]
["C51","JPY",2.5992271502159219,2.570946881560237,1.3136200488791347E-2,1.2993275204670989E-2,1.088026056258129E-2]
["C51","NOK",0.39245731277554602,0.38359645663236275,1.9834349389138994E-3,1.9386531726148192E-3,2.2577885173083678E-2]
["C51","NTD",0.43690152718871555,0.4487089461649138,2.2080509795126312E-3,2.2677243416170611E-3,-2.7025355237767723E-2]
["C51","SEK",0.47877121858585631,0.47824276340324523,2.4196556715269375E-3,2.4169849187119928E-3,1.1037739155915771E-3]
["C51","AUD",1.9478486303957144E-2,3.5293618875516736E-3,9.8442070092143194E-5,1.7836996412001333E-5,0.8188071787264769]
["C51","CLP",1.8568433768577711E-3,1.8568433768577711E-3,9.3842767349755318E-6,9.3842767349755318E-6,0]
["C51","COP",7.3437660516364198E-4,2.7015670868465536E-3,3.711456430003118E-6,1.3653414971364946E-5,-2.6787216093908115]
["C51","IDR",1.7330258190451084E-3,5.8243822313042287E-3,8.7585167803965194E-6,2.9435770054729701E-5,-2.3608167675848271]
["C51","INR",0,1.2607828271090074E-3,0,6.3718540291306421E-6]
["C51","KOR",0,5.5218184209208142E-3,0,2.7906646725312718E-5]
["C51","MXN",0.17463741066302974,3.54588583775699E-3,8.8259775184418732E-4,1.7920506590304066E-5,0.97969572599424914]
["C51","NZD",7.0200471623726168E-2,-4.7744877288753837E-3,3.5478525590976873E-4,-2.4129721803102499E-5,1.0680121887850924]
["C51","PEN",-8.057638199348482E-6,6.5398836362728693E-3,-4.0722393517624079E-8,3.3051833354506773E-5,812.63778696363727]
["C51","PHP",9.3733338846977115E-4,4.9356939565221745E-3,4.7371770931040783E-6,2.4944439872754114E-5,-4.265676030787577]
["C51","RUB",0.18501203132492258,0.18501203132492258,9.3502991307275107E-4,9.3502991307275107E-4,0]
["C51","THB",1.7492394783876132E-3,9.5224668870058458E-3,8.8404587837194753E-6,4.8125472283249378E-5,-4.4437754262116913]
["C51","ZAR",1.7647874930413292E-2,1.6897509850266564E-2,8.9190366939559512E-5,8.5398106562556073E-5,4.2518721551771388E-2]
["C51","CZK",5.982411467911656E-4,5.982411467911656E-4,3.023443197044313E-6,3.023443197044313E-6,0]
["C51","HUF",5.3264250405474169E-4,5.4310908493227644E-4,2.691915064650545E-6,2.7448119824239777E-6,-1.9650292265183333E-2]
["C51","MYR",1.7310551561095981E-3,1.7310551561095981E-3,8.7485572724656559E-6,8.7485572724656559E-6,0]
["C51","PLN",1.3850663752121382E-3,1.3850663752121382E-3,6.999969046013813E-6,6.999969046013813E-6,0]
["C51","RON",-8.1062038255538928E-6,-8.1062038255538928E-6,-4.0967838707993443E-8,-4.0967838707993443E-8,0]
["C51","TRL",5.4847707363735415E-4,5.4847707363735415E-4,2.771941191137272E-6,2.771941191137272E-6,0]
["C55","CAD",47.749200000000002,159.3553,7.1882616956482667E-2,0.23989671009954894]
["C55","CHF",16.881253999999998,16.881253999999998,2.5413383156724943E-2,2.5413383156724943E-2,0]
["C55","EUR",145.40318300000001,145.40318300000001,0.21889290936481351,0.21889290936481351,0]
["C55","GBP",28.537213000000001,28.537213000000001,4.2960500931629383E-2,4.2960500931629383E-2,0]
["C55","HKD",30.765681000000001,30.765681000000001,4.6315281988563925E-2,4.6315281988563925E-2,0]
["C55","SEK",11.868698,11.868698,1.7867379392873008E-2,1.7867379392873008E-2,0]
["C55","USD",383.06106657999999,271.45497285999994,0.57666792155495472,0.40865383786592807,0.29135326833506792]
["C57","CAD",22.344823244544088,22.344823244544088,0.98261763336766716,0.98261763336766716]
["C57","USD",0.39530195826418502,0.39530195826418502,1.7383474930373437E-2,1.7383474930373437E-2,0]
["C58","CAD",94.157692743611307,94.157692743611307,0.93065292342099737,0.93065292342099737]
["C58","EUR",2.7369999999999998E-3,2.7369999999999998E-3,2.7052458245118793E-5,2.7052458245118793E-5,0]
["C58","USD",7.0133873876780761,7.0133873876780761,6.9320193446110318E-2,6.9320193446110318E-2,0]
["C62","CAD",452.57633402592234,578.29660808483834,0.68312419023954118,0.87288789186577576]
["C62","USD",150.2041826584497,53.271754555471816,0.22672000927752547,8.0409030383064364E-2,0.64533774218120932]
["C62","CHF",2.7291710171605077,1.8516034948878246,4.1194437290576731E-3,2.7948327011228587E-3,0.32155094596663436]
["C62","EUR",17.830356638821907,-2.0539914643466801,2.6913355880159182E-2,-3.1003195491003904E-3,1.1151963197345443]
["C62","GBP",4.8242032270635518,-0.66725064933360978,7.2817106756846266E-3,-1.0071561971835726E-3,1.1383131302575242]
["C62","JPY",6.1609590482575687,1.9842571282497374,9.2994260736109623E-3,2.9950616991055489E-3,0.67793047921477068]
["C62","BRL",2.031921196328236,2.8328725385839117,3.06700641972318E-3,4.2759720592485178E-3,-0.39418425463695517]
["C62","CNY",0.22865369590858214,0.22865369590858214,3.4513265303413285E-4,3.4513265303413285E-4,0]
["C62","DKK",0.3921525628579049,0.37670707243592905,5.9191981951341524E-4,5.6860620953406418E-4,3.9386432436940289E-2]
["C62","HKD",6.7818292341225144,6.6553243320781226,1.0236575038493803E-2,1.0045627009900117E-2,1.8653507435410943E-2]
["C62","NOK",1.1247535385625567,1.1909323627525696,1.6977165894087522E-3,1.7976077067450337E-3,-5.883851165704268E-2]
["C62","NTD",1.6529874832893652,1.7007035438809788,2.4950392919428866E-3,2.5670624906884046E-3,-2.8866558926786912E-2]
["C62","SEK",1.3651285663267658,2.2624140119708951,2.0605415624570058E-3,3.4149150623189388E-3,-0.65729006613531626]
["C62","NZD",1.1831859357343184,0.25520822538460181,1.7859151561491614E-3,3.852143808702573E-4,0.78430420978067794]
["C62","AUD",3.6748152563419034,4.9532628738780007,5.5468105765439524E-3,7.4765148669211747E-3,-0.34789439151526991]
["C62","CLP",1.0291446496260197E-2,1.0291446496260197E-2,1.5534033765337434E-5,1.5534033765337434E-5,0]
["C62","IDR",1.2945587518262027,1.7658150662309269,1.9540226312587815E-3,2.6653426097235826E-3,-0.36402852612130143]
["C62","ILS",5.5032779913525856E-2,-1.3159775513457832,8.3067143349358042E-5,-1.9863524262075344E-3,24.912612690356656]
["C62","KOR",1.906963223352709,-0.13977384670482812,2.8783933445684544E-3,-2.1097633408606928E-4,1.0732965612514991]
["C62","MXN",0.52689945590899345,1.4777440665353621,7.9530840897851663E-4,2.230524759996477E-3,-1.8046035158377527]
["C62","MYR",1.106431582077553,1.106431582077553,1.6700612067773101E-3,1.6700612067773101E-3,0]
["C62","PHP",1.1581325886547245,1.1743057556292811,1.74809933117154E-3,1.7725113049369867E-3,-1.3964866486783967E-2]
["C62","PLN",0.20011827977710306,-0.28407823133991872,3.0206095093128168E-4,-4.2879111689840982E-4,2.4195516354444604]
["C62","SGD",0.58365127578524212,-0.44519773633906934,8.809702920308508E-4,-6.7198684568354832E-4,1.7627803704191378]
["C62","THB",0.43138330701349387,0.46279792065167646,6.5113517904267929E-4,6.9855277667172895E-4,-7.2822970030224088E-2]
["C62","TRL",0.13413124119929057,0.87169574186170429,2.0245931711674906E-4,1.3157480915924906E-3,-5.498827074645118]
["C62","ZAR",1.048985314691476,1.8261885200857757,1.5833511162577508E-3,2.7564710308888743E-3,-0.7409095194272457]
["C62","COP",0.46892572539188843,0.47688477359941633,7.0780215923193937E-4,7.1981564282150225E-4,-1.6972940012784266E-2]
["C62","INR",0.45074640876227712,1.9840229888530607,6.8036207892274638E-4,2.994708286269453E-3,-3.4016390375711927]
["C62","AED",3.8278547420930099E-2,3.8278547420930099E-2,5.77781022658843E-5,5.77781022658843E-5,0]
["C62","CZK",7.5332279420515776E-4,7.5332279420515776E-4,1.1370745332673788E-6,1.1370745332673788E-6,0]
["C62","HUF",4.1180080573495037E-2,4.1185444229716157E-2,6.2157711485984557E-5,6.2165807453531472E-5,-1.3024880346090839E-4]
["C62","QAR",4.5910080232194714E-2,4.5910080232194714E-2,6.9297230156656914E-5,6.9297230156656914E-5,0]
["C62","RUB",0.19067365282490664,0.19067365282490664,2.8780511682382663E-4,2.8780511682382663E-4,0]
["C62","PKR",3.2566267611858261E-2,3.2566267611858261E-2,4.9155918060445102E-5,4.9155918060445102E-5,0]
["C62","EGP",1.3772878848610315E-2,1.3772878848610315E-2,2.0788949848591346E-5,2.0788949848591346E-5,0]
["C62","MAD",2.19678775948003E-3,2.19678775948003E-3,3.3158580033859587E-6,3.3158580033859587E-6,0]
["C62","NGN",6.9777139195288307E-3,6.9777139195288307E-3,1.0532245750897542E-5,1.0532245750897542E-5,0]
["C62","PEN",-4.12918046123812E-6,2.6645954805631741E-2,-6.2326349101026154E-9,4.0219726333975748E-5,6454.0855591722066]
["C62","RON",-4.1540681801768274E-6,-4.1540681801768274E-6,-6.2702007339619344E-9,-6.2702007339619344E-9,0]
["C655","CAD",4.6280033536316392,4.9014443779089758,0.88825829212537699,0.94074015928543542]
["C655","EUR",5.5269503893614562E-2,-0.20992311205148978,1.0607942860852666E-2,-4.0290797292136533E-2,4.7981725411460179]
["C655","GBP",3.2993453359401952E-2,-6.4440165430338703E-2,6.3324734865076102E-3,-1.2368079043095986E-2,2.953119751618106]
["C655","JPY",5.9461462611614509E-2,-4.3007479513684548E-2,1.141251057763896E-2,-8.2544776618334315E-3,1.7232832430409131]
["C655","USD",0.23289953895908388,0.42452335119526846,4.4700690752578383E-2,8.1479281255089714E-2,-0.82277454516494042]
["C655","AED",1.5281774121889045E-3,1.5281774121889045E-3,2.9330494264882432E-4,2.9330494264882432E-4,0]
["C655","BRL",9.6052163805799874E-3,9.6052163805799874E-3,1.8435408200414547E-3,1.8435408200414547E-3,0]
["C655","CLP",9.9291567225538521E-5,9.9291567225538521E-5,1.9057150824447912E-5,1.9057150824447912E-5,0]
["C655","CNY",4.7650220995052632E-3,4.7650220995052632E-3,9.1455646606757198E-4,9.1455646606757198E-4,0]
["C655","COP",-2.1784750461901196E-5,-2.1784750461901196E-5,-4.1811735560825299E-6,-4.1811735560825299E-6,0]
["C655","HKD",5.2225970372056743E-2,5.2225970372056743E-2,1.0023793783742801E-2,1.0023793783742801E-2,0]
["C655","IDR",4.0989453090162871E-4,4.0989453090162871E-4,7.8671554048141858E-5,7.8671554048141858E-5,0]
["C655","INR",8.9978119210631004E-3,8.9978119210631004E-3,1.7269609460410541E-3,1.7269609460410541E-3,0]
["C655","KOR",2.0087261990589054E-2,2.0087261990589054E-2,3.8553725366759538E-3,3.8553725366759538E-3,0]
["C655","MXN",3.4581697995898415E-3,3.4581697995898415E-3,6.6373072043104703E-4,6.6373072043104703E-4,0]
["C655","MYR",1.8981995853854059E-3,1.8981995853854059E-3,3.6432374676315804E-4,3.6432374676315804E-4,0]
["C655","NGN",4.404025488153527E-4,4.404025488153527E-4,8.4526994897576429E-5,8.4526994897576429E-5,0]
["C655","NTD",2.1985158813218161E-2,2.1985158813218161E-2,4.2196381738163913E-3,4.2196381738163913E-3,0]
["C655","PHP",2.6202334093370508E-3,2.6202334093370508E-3,5.0290457359353788E-4,5.0290457359353788E-4,0]
["C655","RUB",5.6699865839496726E-3,5.6699865839496726E-3,1.0882473962515206E-3,1.0882473962515206E-3,0]
["C655","THB",4.4788161536203804E-3,4.4788161536203804E-3,8.5962461203416003E-4,8.5962461203416003E-4,0]
["C655","TRL",1.2534140025961982E-3,1.2534140025961982E-3,2.4056926847264946E-4,2.4056926847264946E-4,0]
["C655","ZAR",5.8009562919873574E-3,5.8009562919873574E-3,1.1133845710313149E-3,1.1133845710313149E-3,0]
["C655","AUD",2.0248141718286906E-2,2.0248141718286906E-2,3.8862503777756913E-3,3.8862503777756913E-3,0]
["C655","CHF",1.2361134428056598E-2,1.2361134428056598E-2,2.3724875106630452E-3,2.3724875106630452E-3,0]
["C655","DKK",9.5790025572789154E-3,9.5790025572789154E-3,1.838509569167962E-3,1.838509569167962E-3,0]
["C655","ILS",1.4672863573931287E-3,1.4672863573931287E-3,2.8161804871082273E-4,2.8161804871082273E-4,0]
["C655","NOK",1.0810496428119362E-3,1.0810496428119362E-3,2.0748716801887378E-4,2.0748716801887378E-4,0]
["C655","NZD",3.5685879003547797E-3,3.5685879003547797E-3,6.8492340032144249E-4,6.8492340032144249E-4,0]
["C655","SEK",6.1646162961277277E-3,6.1646162961277277E-3,1.1831822763286874E-3,1.1831822763286874E-3,0]
["C655","SGD",1.81344925990202E-3,1.81344925990202E-3,3.4805751408813863E-4,3.4805751408813863E-4,0]
["C656","CAD",57.150749844642625,88.028711077033606,0.51234910861965755,0.7891660525165165]
["C656","CHF",0.92254140796895556,0.46705305241354644,8.270464855185556E-3,4.1870704362175996E-3,0.49373215296449513]
["C656","EUR",5.3007913255087091,-0.12682662617842891,4.7520911238888797E-2,-1.1369843623818669E-3,1.0239259798000551]
["C656","GBP",1.0323604038683782,0.11336293505372509,9.2549780035086557E-3,1.0162841062133288E-3,0.89019054331322611]
["C656","JPY",2.4018699710983071,-9.0658109413551125E-2,2.1532454815689484E-2,-8.1273826981170295E-4,1.0377448032176761]
["C656","USD",38.087036381017434,17.010084420960876,0.34144537373218731,0.15249321512517985,0.55338913086346886]
["C656","BRL",0.40897596040874484,0.48546815855196768,3.6664167894890905E-3,4.3521594900061203E-3,-0.18703348252247842]
["C656","CNY",0.20752652184417036,0.20752652184417036,1.8604485290365036E-3,1.8604485290365036E-3,0]
["C656","DKK",0.33968241007761596,0.33968241007761596,3.045209039078913E-3,3.045209039078913E-3,0]
["C656","HKD",1.7949830099929829,1.7471038790849256,1.6091791405315119E-2,1.5662561165836003E-2,2.667386300678376E-2]
["C656","NOK",0.25909023764170785,0.16307474182449441,2.322710597299851E-3,1.461944048665753E-3,0.37058708460483136]
["C656","NTD",0.67219134018177851,0.73529412884939493,6.0261087544815706E-3,6.5918171242432076E-3,-9.3876229721364446E-2]
["C656","SEK",0.33574345609206457,0.40456429013149409,3.0098968241232542E-3,3.6268667338867117E-3,-0.20498041820525637]
["C656","AUD",0.29400695101249474,0.28873229650913962,2.6357344337338664E-3,2.5884478357379175E-3,1.7940577544817815E-2]
["C656","KOR",0.51042643050737335,0.4039169810714851,4.5759071822726247E-3,3.6210636915679569E-3,0.20866758276999076]
["C656","SGD",1.5276849671612538E-2,-4.6714839743554726E-2,1.3695498892042816E-4,-4.1879251920548581E-4,4.0578843641016054]
["C656","NZD",0.27436698396865294,-7.0302946997142249E-2,2.4596646597486514E-3,-6.302568614626389E-4,1.2562369056955283]
["C656","CLP",1.4887119808598113E-2,1.4887119808598113E-2,1.3346111091426546E-4,1.3346111091426546E-4,0]
["C656","COP",5.1228510357804206E-3,1.5580021296318355E-2,4.5925699468655859E-5,1.3967288347297634E-4,-2.0412793945207657]
["C656","IDR",2.0367761133732155E-2,7.8153170710727179E-2,1.8259435422655267E-4,7.0063310557235932E-4,-2.8371016921095698]
["C656","INR",0.15633677010628816,0.28245221869635179,1.4015390003835903E-3,2.5321477473192952E-3,-0.80669089238777247]
["C656","MXN",0.48906443275817468,0.15891370683028624,4.3843996248934276E-3,1.4246409060820935E-3,0.67506590913990361]
["C656","PEN",-5.8710307399563058E-5,3.4868675459101203E-2,-5.2633034115425454E-7,3.1259318274532328E-4,594.91062666043388]
["C656","PHP",5.3100225547342353E-2,7.4423572662979789E-2,4.7603668019473809E-4,6.6719773962410102E-4,-0.40156791983164486]
["C656","RUB",0.37109166387818587,0.37109166387818587,3.3267889523937179E-3,3.3267889523937179E-3,0]
["C656","THB",9.1098959795518089E-2,0.13263736982761845,8.1669043668351846E-4,1.1890769304964159E-3,-0.45597019027811103]
["C656","ZAR",0.20904291383718349,0.27235184380940186,1.8740427878703814E-3,2.4415991878669599E-3,-0.30285135626040671]
["C656","AED",2.8401498031233312E-2,2.8401498031233312E-2,2.5461577038484676E-4,2.5461577038484676E-4,0]
["C656","EGP",3.2932568159591875E-4,3.2932568159591875E-4,2.9523623026802163E-6,2.9523623026802163E-6,0]
["C656","MYR",4.7149638364857735E-2,4.7149638364857735E-2,4.2269043282270387E-4,4.2269043282270387E-4,0]
["C656","NGN",7.7544089993030205E-3,7.7544089993030205E-3,6.9517277541680114E-5,6.9517277541680114E-5,0]
["C656","PKR",3.4881289190584231E-4,3.4881289190584231E-4,3.1270626322281946E-6,3.1270626322281946E-6,0]
["C656","TRL",2.6537476236544906E-2,8.0694432494314405E-2,2.3790505517021964E-4,7.2341519002671001E-4,-2.0407726708838143]
["C656","ILS",1.5840321621144545E-6,-8.8379190551798631E-2,1.4200644234596822E-8,-7.92308055849342E-4,55794.810672268897]
["C656","PLN",1.0091998504484639E-2,-3.3555697039296256E-2,9.0473466262810926E-5,-3.0082250038590411E-4,4.3249803816741466]
["C656","CZK",4.358959878592761E-3,4.358959878592761E-3,3.9077513670018879E-5,3.9077513670018879E-5,0]
["C656","HUF",3.8809889912475135E-3,3.9572515592034858E-3,3.4792566250375522E-5,3.5476250345851156E-5,-1.9650292265183333E-2]
["C656","RON",-5.9064170749223329E-5,-5.9064170749223329E-5,-5.2950268048951183E-7,-5.2950268048951183E-7,0]
["C657","CAD",0.21775941904349957,1.0241085382958603,2.3790263516272774E-2,0.11188407877987833]
["C657","CHF",9.6367340933064941E-2,0.22922678920664502,1.0528152790039104E-2,2.5043076180901427E-2,-1.3786771222198806]
["C657","EUR",0.89936540370099094,0.84814645992788995,9.8255864409665467E-2,9.2660183750984879E-2,5.6950093435136795E-2]
["C657","GBP",0.63829480699254015,0.55254462146253658,6.9733845388279647E-2,6.0365619116879876E-2,0.13434260249434515]
["C657","JPY",0.71490918726698272,0.37433297649269476,7.810398296428421E-2,4.0895958451344847E-2,0.47639087151232795]
["C657","USD",4.51413072409441,4.2165694552315713,0.49316975561758164,0.46066112278976667,6.5917734122007077E-2]
["C657","AUD",0.34017342101663484,0.25436777173247488,3.7164019645006152E-2,2.7789733946497426E-2,0.25224089826807472]
["C657","DKK",0.10564166243020122,0.10564166243020122,1.1541374414713952E-2,1.1541374414713952E-2,0]
["C657","HKD",0.59975814386474124,0.55083950564463302,6.5523706626543568E-2,6.0179334845862478E-2,8.1563941599666623E-2]
["C657","KOR",0.23192194865841567,0.22733975077722027,2.5337522932539703E-2,2.4836916825322044E-2,1.9757499916250976E-2]
["C657","NOK",2.7597439668245294E-2,2.7597439668245294E-2,3.0150262384326192E-3,3.0150262384326192E-3,0]
["C657","NTD",0.2419616066469068,0.22973949340298705,2.6434357734031091E-2,2.5099089224977555E-2,5.051261401878282E-2]
["C657","SEK",0.10701509666261,9.4457042861500862E-2,1.1691422400949385E-2,1.0319452313537288E-2,0.11734843206936796]
["C657","SGD",1.7393895705150264E-2,1.7393895705150264E-2,1.9002868588542125E-3,1.9002868588542125E-3,0]
["C657","AED",1.1165484059484861E-2,1.1165484059484861E-2,1.2198315426660178E-3,1.2198315426660178E-3,0]
["C657","BRL",7.0344978827989735E-2,7.0344978827989735E-2,7.6852041152360058E-3,7.6852041152360058E-3,0]
["C657","CNY",3.4754028032083446E-2,3.4754028032083446E-2,3.7968850613531125E-3,3.7968850613531125E-3,0]
["C657","EGP",5.7096614029401991E-6,5.7096614029401991E-6,6.2378174024015375E-7,6.2378174024015375E-7,0]
["C657","IDR",2.9969787230420416E-3,2.9969787230420416E-3,3.2742057214797302E-4,3.2742057214797302E-4,0]
["C657","INR",6.5552868593220071E-2,6.5552868593220071E-2,7.1616650380977431E-3,7.1616650380977431E-3,0]
["C657","MXN",2.5199598427539664E-2,2.5199598427539664E-2,2.7530615655052999E-3,2.7530615655052999E-3,0]
["C657","MYR",1.3831149331984038E-2,1.3831149331984038E-2,1.5110560488549526E-3,1.5110560488549526E-3,0]
["C657","NGN",3.2102947772588361E-3,3.2102947772588361E-3,3.507253970981871E-4,3.507253970981871E-4,0]
["C657","PKR",6.0475195742748929E-6,6.0475195742748929E-6,6.6069281835784831E-7,6.6069281835784831E-7,0]
["C657","PHP",1.9102409383420133E-2,1.9102409383420133E-2,2.0869423468497846E-3,2.0869423468497846E-3,0]
["C657","RUB",4.1372501253638894E-2,4.1372501253638894E-2,4.5199546888705601E-3,4.5199546888705601E-3,0]
["C657","THB",3.2639332589170053E-2,3.2639332589170053E-2,3.5658541279287308E-3,3.5658541279287308E-3,0]
["C657","TRL",9.1448813044375417E-3,9.1448813044375417E-3,9.9908025569330644E-4,9.9908025569330644E-4,0]
["C657","ZAR",4.2234947550866896E-2,4.2234947550866896E-2,4.6141771329320461E-3,4.6141771329320461E-3,0]
["C657","CLP",7.1149012498149874E-4,7.1149012498149874E-4,7.7730449671866843E-5,7.7730449671866843E-5,0]
["C657","COP",-1.5610222763048727E-4,-1.5610222763048727E-4,-1.7054202050679786E-5,-1.7054202050679786E-5,0]
["C657","ILS",8.4359490927903066E-3,8.4359490927903066E-3,9.2162925860512677E-4,9.2162925860512677E-4,0]
["C657","NZD",2.0517076103689635E-2,2.0517076103689635E-2,2.2414949912807004E-3,2.2414949912807004E-3,0]
["C659","CAD",9.8292825353997991E-3,0.19040822293369855,3.1763718000968814E-3,6.1531175612764111E-2]
["C659","CHF",0,6.7545420163908467E-3,0,2.1827571550786383E-3]
["C659","EUR",0.16139735021999271,3.0422051724598984E-2,5.2156196548713112E-2,9.8310071819676798E-3,0.81150835696414969]
["C659","GBP",0,1.67376643904689E-2,0,5.4088429117689126E-3]
["C659","USD",2.8974350075798796,2.8243509728565432,0.93631766281463225,0.91270026590936926,2.5223701146753541E-2]
["C659","BRL",3.1386223745275352E-4,3.1386223745275352E-4,1.0142583210623801E-4,1.0142583210623801E-4,0]
["C659","HKD",2.5484775229768566E-2,2.5484775229768566E-2,8.2355066181187802E-3,8.2355066181187802E-3,0]
["C65","CAD",6.4802,46.403599999999997,4.8914553140096621E-2,0.35026871980676327]
["C65","CHF",5.5159039999999999,2.3212975,4.1635748792270534E-2,1.752187122584541E-2,0.57916281719188722]
["C65","EUR",57.054591000000002,44.022445600000005,0.43066569293478263,0.33229503019323675,0.2284153680113139]
["C65","GBP",57.804309459999999,36.823147620000007,0.43632479966787441,0.27795250317028991,0.36296881730796815]
["C65","HKD",1.5999999999999999E-5,1.5999999999999999E-5,1.2077294685990338E-7,1.2077294685990338E-7,0]
["C65","SEK",5.6249820000000001,2.9094512499999996,4.2459103260869567E-2,2.1961437575483089E-2,0.48276256706243692]
["C65","USD",-6.9999999999999999E-6,-6.9999999999999999E-6,-5.283816425120773E-8,-5.283816425120773E-8,0]
["C75","CAD",4.6368999999999998,362.68630000000002,1.2581454259715902E-2,0.98408874335776064]
["C75","EUR",5.7520090000000001,-9.5516600000001492E-3,1.5607116421526067E-2,-2.591683525509713E-5,1.001660578069332]
["C75","GBP",-2.12E-4,-2.12E-4,-5.7522661758066195E-7,-5.7522661758066195E-7,0]
["C75","USD",358.16165969000002,5.8738327300000188,0.97181188703091903,1.5937664780719323E-2,0.98360005162170627]
["C76","CAD",6.0827999999999998,6.0827999999999998,1.5997370906203144E-3,1.5997370906203144E-3]
["C76","EUR",55.402534000000003,55.402534000000003,1.4570508409639155E-2,1.4570508409639155E-2,0]
["C76","USD",3740.8895038200003,3740.8895038200003,0.98382976444615622,0.98382976444615622,0]
["C84","AUD",20.681249059999999,0.3554987599999942,4.8996471803735966E-2,8.4222113084512194E-4,0.98281057594884003]
["C84","CAD",31.295500000000001,409.32650000000001,7.4142962975071822E-2,0.96974579521706761]
["C84","EUR",34.442816999999998,-2.9340708900000005,8.1599351523004085E-2,-6.9511817789620258E-3,1.0851867281935736]
["C84","GBP",30.084965,0.21772046000000089,7.1275053796914303E-2,5.1580706506352907E-4,0.99276314730630399]
["C84","HKD",12.487387999999999,-0.12841557000000028,2.9584187699169408E-2,-3.0423258461864373E-4,1.0102836213626101]
["C84","JPY",32.398701109999998,4.9871766800000001,7.6756584711512782E-2,1.1815246790605092E-2,0.84606862284177542]
["C84","KOR",4.5928440000000004,4.5928440000000004,1.0881023234723229E-2,1.0881023234723229E-2,0]
["C84","NTD",5.1240269999999999,5.1240269999999999,1.2139462355427086E-2,1.2139462355427086E-2,0]
["C84","SEK",5.7867160000000002,6.4461199999999261E-2,1.3709455676862672E-2,1.5271666421462016E-4,0.98886048667327042]
["C84","USD",245.20247599999999,0.49097513999998571,0.58091540635119865,1.1631816595580721E-3,0.99799767462380773]
["C85","AUD",35.908577090000001,35.908577090000001,4.9279060482391265E-2,4.9279060482391265E-2,0]
["C85","CAD",31.831,31.831,4.36832061121082E-2,4.36832061121082E-2]
["C85","EUR",60.589140999999998,60.589140999999998,8.3149380618220775E-2,8.3149380618220775E-2,0]
["C85","GBP",53.700055999999996,53.700055999999996,7.369515926234653E-2,7.369515926234653E-2,0]
["C85","HKD",21.679801000000001,21.679801000000001,2.9752229447786417E-2,2.9752229447786417E-2,0]
["C85","JPY",62.690134210000004,62.690134210000004,8.6032674244954768E-2,8.6032674244954768E-2,0]
["C85","KOR",7.9892799999999999,7.9892799999999999,1.0964071657420244E-2,1.0964071657420244E-2,0]
["C85","SEK",10.04983,10.04983,1.3791863129705267E-2,1.3791863129705267E-2,0]
["C85","NTD",8.8589660000000006,8.8589660000000006,1.2157583416108786E-2,1.2157583416108786E-2,0]
["C85","USD",435.38144199999999,435.38144199999999,0.5974948090940555,0.5974948090940555,0]
["C88","CAD",1.2388999999999999,1.2388999999999999,4.4413773324490487E-2,4.4413773324490487E-2]
["C88","USD",26.655538649999997,26.655538649999997,0.95558402731721293,0.95558402731721293,0]
["C96","CAD",86.274100000000004,89.045400000000001,0.60838154365161079,0.62792399928918574]
["C96","CHF",4.559018,4.559018,3.214895789553851E-2,3.214895789553851E-2,0]
["C96","EUR",1.594147,1.594147,1.1241492089370789E-2,1.1241492089370789E-2,0]
["C96","HKD",3.4361739999999998,3.4361739999999998,2.4230966679171732E-2,2.4230966679171732E-2,0]
["C96","JPY",3.69617511,3.69617511,2.6064423958389159E-2,2.6064423958389159E-2,0]
["C96","KOR",2.7215720000000001,2.7215720000000001,1.919178727473253E-2,1.919178727473253E-2,0]
["C96","USD",39.528008999999997,36.756715159999999,0.27874079396823337,0.25919838176930693,7.010962378600949E-2]
["C98","CAD",155.28186432128734,158.56080272074095,0.78797242292667424,0.80461128185934983]
["C98","EUR",8.4336372352285043,5.9782295174934346,4.2796198998343714E-2,3.0336317884259743E-2,0.29114457371707692]
["C98","USD",22.0412077307084,22.0412077307084,0.11184734248077616,0.11184734248077616,0]
["C98","BRL",0.37121079567571214,0.37121079567571214,1.8836962794310718E-3,1.8836962794310718E-3,0]
["C98","CHF",3.1190931277239118,2.5233545560382407,1.5827729657478223E-2,1.280467498323265E-2,0.19099736599413364]
["C98","CNY",0.29472999072287548,0.29472999072287548,1.4955970931579234E-3,1.4955970931579234E-3,0]
["C98","DKK",0.71331926946468438,0.71331926946468438,3.6197138380397358E-3,3.6197138380397358E-3,0]
["C98","GBP",1.5515933639964739,1.3237997165846105,7.8735065924736228E-3,6.7175756467513044E-3,0.14681272342202478]
["C98","HKD",1.5736293837632185,1.5736293837632185,7.9853276088115988E-3,7.9853276088115988E-3,0]
["C98","JPY",2.4395968590128434,2.4395968590128434,1.2379649461080848E-2,1.2379649461080848E-2,0]
["C98","NOK",0.36683512845801519,0.36683512845801519,1.8614921082323313E-3,1.8614921082323313E-3,0]
["C98","NTD",0.47026172053849197,0.47026172053849197,2.3863267546536246E-3,2.3863267546536246E-3,0]
["C98","SEK",0.40812765138251994,0.40812765138251994,2.0710295804915227E-3,2.0710295804915227E-3,0]
["C99","CAD",1.4830000000000001,1.4830000000000001,1.3607277278324333E-2,1.3607277278324333E-2]
["C99","USD",107.502819,107.502819,0.98639289705631383,0.98639289705631383,0]
["E01","AUD",1.3726689999999999,0.53352062000000011,7.8808583882198392E-3,3.0630840016167412E-3,0.61132609536603499]
["E01","BRL",1.8694950586692922,2.0739082716767183,1.0733269138335194E-2,1.1906859846941962E-2,-0.10934140320912511]
["E01","CAD",42.455980378344393,151.04161525290175,0.24375109301278919,0.86717014847432594]
["E01","CHF",0,-9.346241000000001E-2,0,-5.3659259284776005E-4]
["E01","CLP",0.28618057182246104,0.28618057182246104,1.6430388972087171E-3,1.6430388972087171E-3,0]
["E01","COP",0.10497504256814519,0.40449354256814518,6.0268968322071948E-4,2.3223051791283447E-3,-2.8532353278691525]
["E01","EUR",5.582786348808888,1.6075565287930822,3.2052263602259351E-2,9.2294102616701703E-3,0.71205121809182947]
["E01","GBP",0.18528500000000001,0.95945635000000007,1.0637705422511276E-3,5.5084944906807765E-3,-4.1782732007447985]
["E01","IDR",0.24772638159601573,0.87249512925566619,1.4222631474771481E-3,5.0092269571728291E-3,-2.5220113563782776]
["E01","INR",0,0.19190368000000002,0,1.1017701472520003E-3]
["E01","JPY",13.832793000000001,2.0515087300000006,7.9417749469506985E-2,1.1778258111261153E-2,0.85169237116466645]
["E01","KOR",0,0.84330044999999998,0,4.8416125265246506E-3]
["E01","MXN",5.6337933890357386,0.11048793903573861,3.2345108607741403E-2,6.343406903972647E-4,0.98038835800212942]
["E01","NOK",1.298362,-0.11492442000000015,7.4542421069069735E-3,-6.5981170942761957E-4,1.0885149288103011]
["E01","NTD",0,1.8024939800000002,0,1.0348598097573972E-2]
["E01","NZD",2.0279389999999999,-0.6505108799999999,1.1642938012695088E-2,-3.7347562487943333E-3,1.3207743822669222]
["E01","PEN",-1.1517944703410556E-3,1.0003590939576306,-6.6127588756594165E-6,5.7433280396424714E-3,869.52222311973435]
["E01","PHP",0.13398658353670209,0.74510469353670206,7.6925266817720584E-4,4.2778445307358817E-3,-4.5610395747765322]
["E01","RUB",3.2890052784691415,3.2890052784691415,1.8883055447251204E-2,1.8883055447251204E-2,0]
["E01","SEK",3.4426960000000002,3.3663169900000001,1.976543482055098E-2,1.9326922577874536E-2,2.2185813095318307E-2]
["E01","THB",0.25004403383016555,1.4364724238301654,1.4355694063425237E-3,8.247170840740517E-3,-4.7448778194237722]
["E01","USD",90.134501637837943,0.50343466259515002,0.51748618443380745,2.8903525056904562E-3,0.99441462865554009]
["E01","ZAR",1.3462462899501537,1.2311487976514419,7.7291585711948821E-3,7.0683532075963952E-3,8.5495123112260152E-2]
["E01","CZK",8.5515237561829341E-2,8.5515237561829341E-2,4.9096575886812849E-4,4.9096575886812849E-4,0]
["E01","HUF",7.6138277204909788E-2,7.7634416604553808E-2,4.3713013157208383E-4,4.4571986641539328E-4,-1.9650292265183333E-2]
["E01","MYR",0.24744468631312125,0.24744468631312125,1.4206458598184913E-3,1.4206458598184913E-3,0]
["E01","PLN",0.19798751849563848,0.19798751849563848,1.1366990847022722E-3,1.1366990847022722E-3,0]
["E01","RON",-1.1587366559205185E-3,-1.1587366559205185E-3,-6.6526158123692054E-6,-6.6526158123692054E-6,0]
["E01","TRL",7.8401740670787215E-2,7.8401740670787215E-2,4.5012527828370132E-4,4.5012527828370132E-4,0]
["E02","AUD",0.49451000000000001,-5.5536400000000142E-3,8.8552624533899389E-4,-9.9449838773016974E-6,1.0112305918990516]
["E02","BRL",1.5982713290724431,1.6010752796887799,2.8620477018998281E-3,2.8670687770275321E-3,-1.7543645846191946E-3]
["E02","CAD",239.84600665568976,528.13653071974261,0.42949573058859131,0.94574176270371857]
["E02","EUR",0.77951199999999998,1.007673999999999E-2,1.3958834696096941E-3,1.8044564796378729E-5,0.98707301491189359]
["E02","MXN",2.6549088558786251,0.59607531587862528,4.7541838807373827E-3,1.0674007328653693E-3,0.7754818156718386]
["E02","RUB",2.9579748126321119,2.9579748126321119,5.2968884949494005E-3,5.2968884949494005E-3,0]
["E02","USD",305.78551697685953,20.821506090496179,0.54757457023631795,3.7285373623627584E-2,0.93190813516497628]
["E02","ZAR",1.0768682378903383,1.0811831148331725,1.9283636072553634E-3,1.9360903201191837E-3,-4.0068754848665566E-3]
["E02","CLP",0.11884305800941423,0.11884305800941423,2.1281399151418744E-4,2.1281399151418744E-4,0]
["E02","COP",0.23094509364991941,0.23094509364991941,4.135567362829376E-4,4.135567362829376E-4,0]
["E02","CZK",0.18813352263602454,0.18813352263602454,3.3689343374709797E-4,3.3689343374709797E-4,0]
["E02","HUF",0.1675042098508015,0.17079571653001835,2.9995222346899995E-4,3.0584637232575738E-4,-1.9650292265183333E-2]
["E02","IDR",0.54499803951123449,0.54749710236246563,9.7593591160036425E-4,9.8041101977515725E-4,-4.5854529191928783E-3]
["E02","MYR",0.54437830988886671,0.54437830988886671,9.7482615275702299E-4,9.7482615275702299E-4,0]
["E02","PEN",-2.5339478347503222E-3,-1.3600193293212489E-2,-4.5375772218788829E-6,-2.435406382646058E-5,-4.3671954515798301]
["E02","PHP",0.29477048378074455,0.29477048378074455,5.2784979017435753E-4,5.2784979017435753E-4,0]
["E02","PLN",0.43557254069040457,0.43557254069040457,7.7998608022151247E-4,7.7998608022151247E-4,0]
["E02","RON",-2.5492206430251401E-3,-2.5492206430251401E-3,-4.5649264616665144E-6,-4.5649264616665144E-6,0]
["E02","THB",0.55009687442636412,0.55009687442636412,9.8506646940101149E-4,9.8506646940101149E-4,0]
["E02","TRL",0.17248382947573188,0.17248382947573188,3.0886930071653986E-4,3.0886930071653986E-4,0]
["E03","CAD",14.007,552.51790000000005,2.4480991446072083E-2,0.96567330504045923]
["E03","EUR",3.4220320000000002,8.7168100000000096E-2,5.9809192632387341E-3,1.5234964735277778E-4,0.97452738606769307]
["E03","USD",554.72916801999997,19.553136729999899,0.96953808932564456,3.4174353753909141E-2,0.96475192245651853]
["E04","CAD",158.38307893861773,185.39039594246032,0.83470531037130824,0.97703838706774915]
["E04","EUR",1.4878000000000001E-2,1.1567000000000008E-4,7.8409547856543945E-5,6.0960024200607903E-7,0.99222543352601156]
["E04","NZD",2.1614000000000001E-2,2.1614000000000001E-2,1.1390939423116957E-4,1.1390939423116957E-4,0]
["E04","USD",31.327751508070538,4.3351693069646444,0.16510248898440472,2.2847067162297667E-2,0.86161888107903839]
["E05","CAD",345.10359999999997,345.10359999999997,0.99999101727089035,0.99999101727089035]
["E05","USD",3.0119999999999999E-3,3.0119999999999999E-3,8.7277355090469115E-6,8.7277355090469115E-6,0]
["E06","CAD",0.17280000000000001,0.17280000000000001,1.6104305198950612E-3,1.6104305198950612E-3]
["E06","USD",107.127683,107.127683,0.99838941104654688,0.99838941104654688,0]
["E07","CAD",2.46E-2,2.46E-2,1.2259787895702097E-3,1.2259787895702097E-3]
["E07","CHF",1.765855,1.765855,8.800409656327246E-2,8.800409656327246E-2,0]
["E07","DKK",1.7714479999999999,1.7714479999999999,8.8282832310023124E-2,8.8282832310023124E-2,0]
["E07","EUR",9.458107,9.458107,0.4713592915238019,0.4713592915238019,0]
["E07","GBP",5.1899240000000004,5.1899240000000004,0.25864783510086919,0.25864783510086919,0]
["E07","NOK",0.39702700000000002,0.39702700000000002,1.9786450442548443E-2,1.9786450442548443E-2,0]
["E07","SEK",0.81132300000000002,0.81132300000000002,4.043352802806794E-2,4.043352802806794E-2,0]
["E07","USD",0.64730600000000005,0.64730600000000005,3.225948887648513E-2,3.225948887648513E-2,0]
["E08","AUD",8.9073910000000005,8.9073910000000005,2.8865976942583308E-2,2.8865976942583308E-2,0]
["E08","CAD",19.382899999999999,19.382899999999999,6.2813717785645415E-2,6.2813717785645415E-2]
["E08","CHF",6.8915369999999996,6.8915369999999996,2.233324529494211E-2,2.233324529494211E-2,0]
["E08","DKK",8.000826,8.000826,2.5928092618548015E-2,2.5928092618548015E-2,0]
["E08","EUR",34.032139000000001,34.032139000000001,0.11028716934967715,0.11028716934967715,0]
["E08","GBP",25.799627999999998,25.799627999999998,8.360826048561544E-2,8.360826048561544E-2,0]
["E08","HKD",7.6313170000000001,7.6313170000000001,2.4730633309298315E-2,2.4730633309298315E-2,0]
["E08","ILS",0.80278700000000003,0.80278700000000003,2.6015733486725377E-3,2.6015733486725377E-3,0]
["E08","JPY",35.349066999999998,35.349066999999998,0.11455490760019768,0.11455490760019768,0]
["E08","NOK",1.995115,1.995115,6.4655232478064662E-3,6.4655232478064662E-3,0]
["E08","NZD",1.2734719999999999,1.2734719999999999,4.1269113917897443E-3,4.1269113917897443E-3,0]
["E08","SEK",2.8444669999999999,2.8444669999999999,9.2179987199325943E-3,9.2179987199325943E-3,0]
["E08","SGD",0.60194300000000001,0.60194300000000001,1.950702821819478E-3,1.950702821819478E-3,0]
["E08","USD",155.064851,155.064851,0.5025150926428531,0.5025150926428531,0]
["E09","BRL",6.7408869999999999,6.7408869999999999,0.10383438899808378,0.10383438899808378,0]
["E09","CAD",5.8099999999999999E-2,5.8099999999999999E-2,8.9495314204030832E-4,8.9495314204030832E-4]
["E09","COP",0.13453000000000001,0.13453000000000001,2.0722555283766383E-3,2.0722555283766383E-3,0]
["E09","EUR",1.2187760000000001,1.2187760000000001,1.8773621525702562E-2,1.8773621525702562E-2,0]
["E09","GBP",0.26304,0.26304,4.051780972156329E-3,4.051780972156329E-3,0]
["E09","HKD",8.8197759999999992,8.8197759999999992,0.13585690608075218,0.13585690608075218,0]
["E09","HUF",0.39202100000000001,0.39202100000000001,6.0385615438172755E-3,6.0385615438172755E-3,0]
["E09","IDR",1.139473,1.139473,1.7552064399657421E-2,1.7552064399657421E-2,0]
["E09","INR",14.354091,14.354091,0.2211056599239675,0.2211056599239675,0]
["E09","KOR",6.4253299999999998,6.4253299999999998,9.8973653565333122E-2,9.8973653565333122E-2,0]
["E09","MXN",2.4584440000000001,2.4584440000000001,3.7869056494494728E-2,3.7869056494494728E-2,0]
["E09","MYR",2.1566939999999999,2.1566939999999999,3.3220999513244073E-2,3.3220999513244073E-2,0]
["E09","NTD",8.1492900000000006,8.1492900000000006,0.12552896197758459,0.12552896197758459,0]
["E09","PHP",1.603192,1.603192,2.4695038170290635E-2,2.4695038170290635E-2,0]
["E09","PLN",0.39518500000000001,0.39518500000000001,6.0872987510705552E-3,6.0872987510705552E-3,0]
["E09","THB",5.1719910000000002,5.1719910000000002,7.9667635043962071E-2,7.9667635043962071E-2,0]
["E09","TRL",1.061687,1.061687,1.6353874638783975E-2,1.6353874638783975E-2,0]
["E09","USD",2.2893110000000001,2.2893110000000001,3.5263787823708093E-2,3.5263787823708093E-2,0]
["E09","ZAR",2.0877840000000001,2.0877840000000001,3.215953271431124E-2,3.215953271431124E-2,0]
["E10","AUD",6.4396810000000002,6.4396810000000002,8.8994915706307756E-2,8.8994915706307756E-2,0]
["E10","CAD",0.26240000000000002,0.26240000000000002,3.6263078685629239E-3,3.6263078685629239E-3]
["E10","CHF",3.9313120000000001,3.9313120000000001,5.432983094274331E-2,5.432983094274331E-2,0]
["E10","DKK",3.0464880000000001,3.0464880000000001,4.2101766028515716E-2,4.2101766028515716E-2,0]
["E10","EUR",16.579117,16.579117,0.2291195976788313,0.2291195976788313,0]
["E10","GBP",10.493176,10.493176,0.14501328770966321,0.14501328770966321,0]
["E10","HKD",6.059971,6.059971,8.3747410520438756E-2,8.3747410520438756E-2,0]
["E10","ILS",0.46665299999999998,0.46665299999999998,6.4490375220598089E-3,6.4490375220598089E-3,0]
["E10","JPY",18.911011999999999,18.911011999999999,0.26134585220307877,0.26134585220307877,0]
["E10","NOK",0.34381499999999998,0.34381499999999998,4.751444511547109E-3,4.751444511547109E-3,0]
["E10","NZD",1.1349469999999999,1.1349469999999999,1.568470745618096E-2,1.568470745618096E-2,0]
["E10","SEK",1.960583,1.960583,2.7094807773897493E-2,2.7094807773897493E-2,0]
["E10","SGD",0.57674599999999998,0.57674599999999998,7.9704975532095719E-3,7.9704975532095719E-3,0]
["E10","USD",2.1542129999999999,2.1542129999999999,2.9770730001755109E-2,2.9770730001755109E-2,0]
["E11","BRL",0.16223299999999999,0.16223299999999999,8.1960405313308477E-4,8.1960405313308477E-4,0]
["E11","CAD",51.392000000000003,173.45240000000001,0.25963331442194559,0.87628466505372571]
["E11","EUR",3.7060140000000001,-2.4491669999999924E-2,1.8722849823204626E-2,-1.2373236024728579E-4,1.0066086285696707]
["E11","GBP",3.552473,0.10237137999999989,1.7947157911435092E-2,5.1718206513364808E-4,0.97118306599374582]
["E11","MXN",1.7528410000000001,3.4656260000000008E-2,8.8553844661557728E-3,1.750840529512122E-4,0.98022852044195674]
["E11","RUB",2.4262359999999998,2.4262359999999998,1.2257388197576343E-2,1.2257388197576343E-2,0]
["E11","USD",134.83721902000002,21.675591680000021,0.68120007163761687,0.10950548159120393,0.83924622713566244]
["E11","ZAR",0.11163099999999999,0.11163099999999999,5.6396183301362474E-4,5.6396183301362474E-4,0]
["E12","AUD",0.3549831636003945,0.3549831636003945,3.7402476435363825E-2,3.7402476435363825E-2,0]
["E12","CAD",0.52403842723233607,0.52403842723233607,5.5214829703435511E-2,5.5214829703435511E-2]
["E12","CHF",5.0437784700953267E-2,5.0437784700953267E-2,5.3143310645937967E-3,5.3143310645937967E-3,0]
["E12","DKK",2.6222157223257343E-2,2.6222157223257343E-2,2.762873618229814E-3,2.762873618229814E-3,0]
["E12","EUR",1.5847352046232226,1.5847352046232226,0.1669741757497416,0.1669741757497416,0]
["E12","GBP",0.36053086419800062,0.36053086419800062,3.7987004836000864E-2,3.7987004836000864E-2,0]
["E12","HKD",4.5210740041317171E-2,4.5210740041317171E-2,4.7635882836524644E-3,4.7635882836524644E-3,0]
["E12","ILS",9.0647832889920142E-3,9.0647832889920142E-3,9.5510260238670876E-4,9.5510260238670876E-4,0]
["E12","NOK",5.9084572331697512E-2,5.9084572331697512E-2,6.2253919366653861E-3,6.2253919366653861E-3,0]
["E12","NZD",9.2924232379759074E-3,9.2924232379759074E-3,9.790876774569226E-4,9.790876774569226E-4,0]
["E12","SEK",0.34387510422739137,0.34387510422739137,3.6232085916761463E-2,3.6232085916761463E-2,0]
["E12","SGD",1.4135147450965833E-2,1.4135147450965833E-2,1.4893368859608502E-3,1.4893368859608502E-3,0]
["E12","USD",6.1061611821270301,6.1061611821270301,0.64337008946749308,0.64337008946749308,0]
["E12","JPY",3.1557514396272014E-3,3.1557514396272014E-3,3.325028648102078E-4,3.325028648102078E-4,0]
["E13","CAD",0.17712734760977189,2.1651031821244162,4.606812858846053E-2,0.56311040134318613]
["E13","USD",3.6660169699664902,1.679701840012237,0.95347524512119697,0.43686489635939479,0.54181831296116711]
["E13","EUR",1.6897293102502069E-3,4.3041822370106769E-5,4.394728888268113E-4,1.1194523230801002E-5,0.97452738606769307]
["E14","AUD",0.95517600000000003,0.95517600000000003,6.3317490305260016E-2,6.3317490305260016E-2,0]
["E14","CAD",1.1556999999999999,1.1556999999999999,7.6609989725232835E-2,7.6609989725232835E-2]
["E14","EUR",0.94796000000000002,0.94796000000000002,6.2839150177322597E-2,6.2839150177322597E-2,0]
["E14","GBP",0.61951000000000001,0.61951000000000001,4.1066587120082196E-2,4.1066587120082196E-2,0]
["E14","HKD",0.44864900000000002,0.44864900000000002,2.9740412979351035E-2,2.9740412979351035E-2,0]
["E14","JPY",1.3953709999999999,1.3953709999999999,9.2497497597030257E-2,9.2497497597030257E-2,0]
["E14","KOR",0.23247699999999999,0.23247699999999999,1.5410626097908588E-2,1.5410626097908588E-2,0]
["E14","NTD",0.28197,0.28197,1.8691458685492691E-2,1.8691458685492691E-2,0]
["E14","SEK",0.44280399999999998,0.44280399999999998,2.9352954824168904E-2,2.9352954824168904E-2,0]
["E14","USD",8.6058660000000007,8.6058660000000007,0.57047270557820429,0.57047270557820429,0]
["E15","CAD",16.13617978926403,17.780080285929149,0.89067494200212127,0.98141395201852144]
["E15","USD",1.9604295880175804,0.33197437579125699,0.10821058840510357,1.8324117713462477E-2,0.83066243346849555]
["E15","EUR",6.7066562192336678E-3,-3.1118129914667033E-5,3.7018989110845557E-4,-1.7176394238865049E-6,1.004639887433834]
["E15","BRL",2.7557120884386078E-4,2.7557120884386078E-4,1.5210810344203213E-5,1.5210810344203213E-5,0]
["E15","GBP",6.0342795793406814E-3,1.7388943641314777E-4,3.3307645827854155E-4,9.5982423172496112E-6,0.97118306599374582]
["E15","MXN",2.9773998710563316E-3,5.8867600686710731E-5,1.6434468951781394E-4,3.2493376692744155E-6,0.98022852044195674]
["E15","RUB",4.1212378952524666E-3,4.1212378952524666E-3,2.2748155829133547E-4,2.2748155829133547E-4,0]
["E15","ZAR",1.8961795451263936E-4,1.8961795451263936E-4,1.0466415399664364E-5,1.0466415399664364E-5,0]
["E16","CAD",0.87709999999999999,0.87709999999999999,0.14528017491262651,0.14528017491262651]
["E16","HKD",5.1601990000000004,5.1601990000000004,0.85471965945041661,0.85471965945041661,0]
["E17","CAD",73.121899999999997,73.121899999999997,0.99976209780514713,0.99976209780514713]
["E17","USD",1.7377E-2,1.7377E-2,2.3758772643435198E-4,2.3758772643435198E-4,0]
["E18","CAD",33.8812,33.8812,0.99966364339118274,0.99966364339118274]
["E18","USD",1.1384999999999999E-2,1.1384999999999999E-2,3.3591403433197805E-4,3.3591403433197805E-4,0]
["E19","CAD",0.14960000000000001,0.14960000000000001,7.4673913097734481E-4,7.4673913097734481E-4]
["E19","USD",200.188073,200.188073,0.9992531260965859,0.9992531260965859,0]
["E20","CAD",6.2000658473926773E-2,4.1761006584739269,1.4722800739439299E-2,0.99166523994916578]
["E20","USD",4.1491634019152528,3.5118491915252292E-2,0.98526866496847754,8.339307540665912E-3,0.99153600653591001]
["E21","AUD",1.8068610000000001,1.8068610000000001,6.9874934740994266E-2,6.9874934740994266E-2,0]
["E21","CAD",4.3900000000000002E-2,4.3900000000000002E-2,1.6977009493976836E-3,1.6977009493976836E-3]
["E21","CHF",2.1901570000000001,2.1901570000000001,8.4697758957402794E-2,8.4697758957402794E-2,0]
["E21","DKK",0.43296699999999999,0.43296699999999999,1.6743701297445714E-2,1.6743701297445714E-2,0]
["E21","EUR",7.7709820000000001,7.7709820000000001,0.30051944234971095,0.30051944234971095,0]
["E21","GBP",4.1720050000000004,4.1720050000000004,0.16133979155790168,0.16133979155790168,0]
["E21","HKD",0.89637800000000001,0.89637800000000001,3.4664733066496513E-2,3.4664733066496513E-2,0]
["E21","ILS",0.128278,0.128278,4.9607672525475181E-3,4.9607672525475181E-3,0]
["E21","JPY",6.6599469999999998,6.6599469999999998,0.25755349304870739,0.25755349304870739,0]
["E21","NOK",0.21013899999999999,0.21013899999999999,8.1264961231316581E-3,8.1264961231316581E-3,0]
["E21","NZD",8.1088999999999994E-2,8.1088999999999994E-2,3.135874083956919E-3,3.135874083956919E-3,0]
["E21","SEK",0.73675500000000005,0.73675500000000005,2.8491791867277686E-2,2.8491791867277686E-2,0]
["E21","SGD",0.35486099999999998,0.35486099999999998,1.3723185799640349E-2,1.3723185799640349E-2,0]
["E21","USD",0.37424200000000002,0.37424200000000002,1.4472687897596535E-2,1.4472687897596535E-2,0]
["E22","AUD",0.13873863593267011,3.3690059326701161E-3,7.0612090763777544E-2,1.7146813582400834E-3,0.97571688729659201]
["E22","CAD",-1.7329167314229364E-2,1.9159708326857707,-8.8198123545548471E-3,0.97514802152166669]
["E22","CHF",0.16816976771228612,3.5706277122861119E-3,8.5591290570178197E-2,1.8172983063345438E-3,0.97876771930615414]
["E22","DKK",3.3245086912529732E-2,5.4010691252973086E-4,1.6920341466067659E-2,2.7489154750088093E-4,0.98375378250774947]
["E22","EUR",0.59668975230376475,1.3899722303764683E-2,0.3036898169298477,7.0743700650268138E-3,0.97670527732360224]
["E22","GBP",0.32034466558538782,6.1584755853879014E-3,0.1630418696994034,3.134403290608663E-3,0.98077547015139432]
["E22","HKD",6.8827796382818038E-2,2.7936863828180308E-3,3.5030433826759994E-2,1.4218680694310011E-3,0.95941049213199225]
["E22","ILS",9.8497420333778073E-3,1.1909203337780866E-4,5.0131016049357732E-3,6.061280200417786E-5,0.98790912158163724]
["E22","JPY",0.51137965906833927,1.450230906833927E-2,0.26027059195253421,7.3810612114918921E-3,0.9716408175194915]
["E22","NOK",1.6135385188044551E-2,3.8067518804455261E-4,8.2122278033614372E-3,1.9374755091844086E-4,0.97640743102144145]
["E22","NZD",6.2263656413771096E-3,3.1295564137710959E-4,3.1689564542839522E-3,1.5928116926766572E-4,0.94973702808306448]
["E22","SEK",5.6571249098062541E-2,1.1055590980625363E-3,2.8792370265707728E-2,5.6268276570772412E-4,0.98045722667098756]
["E22","SGD",2.7247768968229016E-2,1.1052389682290227E-3,1.3867960590507438E-2,5.6251983317845216E-4,0.95943745084165477]
["E22","USD",2.8735926332304661E-2,1.080696332304662E-3,1.462536967238633E-2,5.5002867075766592E-4,0.96239215260342059]
["E23","CAD",83.555300000000003,83.555300000000003,1,1]
["E24","CAD",4.0536000000000003,4.0536000000000003,1,1]
["E25","CAD",12.3782,12.3782,1,1]
["E26","CAD",1.1894,423.13729999999998,2.8121986148964247E-3,1.0004591634193818]
["E26","USD",421.75377370000001,-0.19418313000011445,0.9971879756402221,-4.5912353222008926E-4,1.0004604182395254]
["E27","CAD",3.4882,298.90410000000003,1.1747755660692539E-2,1.0066659975859209]
["E27","USD",293.43652193999998,-1.9793561300001143,0.98825198144445991,-6.6661866236842268E-3,1.0067454320849838]
["E28","CAD",0.7833,34.896900000000002,2.2836801273473102E-2,1.0174052985577218]
["E28","USD",33.516698939999998,-0.59698779000000657,0.97716608328304155,-1.7404942580007715E-2,1.0178116523667413]
["E29","BRL",6.9069380000000002,6.9425546599999999,9.7919500289919179E-2,9.8424436855036157E-2,-5.1566497339341488E-3]
["E29","CAD",1.0866,1.0866,1.5404703070307882E-2,1.5404703070307882E-2]
["E29","CLP",1.5095817900000001,1.5095817900000001,2.1401306124879321E-2,2.1401306124879321E-2,0]
["E29","COP",2.9335369999999998,2.9335369999999998,4.1588686205376188E-2,4.1588686205376188E-2,0]
["E29","CZK",2.3897309999999998,2.3897309999999998,3.3879161119924464E-2,3.3879161119924464E-2,0]
["E29","HUF",2.127691,2.1695007500000001,3.0164226100097963E-2,3.0756961958917958E-2,-1.9650292265183333E-2]
["E29","IDR",6.9227359999999996,6.9544798800000001,9.8143468170560369E-2,9.8593500423182767E-2,-4.5854529191926563E-3]
["E29","MXN",6.9498150000000001,6.9498150000000001,9.8527366527306981E-2,9.8527366527306981E-2,0]
["E29","MYR",6.9148639999999997,6.9148639999999997,9.8031867008615339E-2,9.8031867008615339E-2,0]
["E29","PEN",-3.2187E-2,-0.17275392000000001,-4.5631435461439333E-4,-2.4491283285769578E-3,-4.3671954515798301]
["E29","PHP",3.7442671199999999,3.7442671199999999,5.3082388366939855E-2,5.3082388366939855E-2,0]
["E29","PLN",5.5327789999999997,5.5327789999999997,7.8438079926960211E-2,7.8438079926960211E-2,0]
["E29","RON",-3.2381E-2,-3.2381E-2,-4.5906468812777424E-4,-4.5906468812777424E-4,0]
["E29","RUB",4.8418020000000004,4.8418020000000004,6.8642114978117841E-2,6.8642114978117841E-2,0]
["E29","THB",6.9875030000000002,6.9875030000000002,9.9061668431700292E-2,9.9061668431700292E-2,0]
["E29","TRL",2.1909436900000001,2.1909436900000001,3.1060958023389179E-2,3.1060958023389179E-2,0]
["E29","ZAR",5.1913115599999999,5.2461204799999992,7.3597103927164356E-2,7.4374128718443816E-2,-1.0557817493042077E-2]
["E29","USD",4.3713769999999998,4.3479647100000003,6.1972910632590882E-2,6.1640995138714634E-2,5.3558157990032385E-3]
["E30","CAD",4.2522000000000002,245.83670000000001,1.7656760743043929E-2,1.0208080038002605]
["E30","USD",236.57341944000001,-5.0110580600000025,0.98234331997927138,-2.0807829649339617E-2,1.0211818304518818]
["Q123","CAD",234.96860000000001,234.96860000000001,0.99988723169121407,0.99988723169121407]
["Q123","USD",2.6539E-2,2.6539E-2,1.1293426969328296E-4,1.1293426969328296E-4,0]
["Q124","CAD",3.2827000000000002,3.2827000000000002,0.90462411816578492,0.90462411816578492]
["Q124","USD",0.34610999999999997,0.34610999999999997,9.5378637566137556E-2,9.5378637566137556E-2,0]
["Q144","CAD",4.0552000000000001,4.0552000000000001,0.90584582393280766,0.90584582393280766]
["Q144","USD",0.42157051000000001,0.42157051000000001,9.4169926508365545E-2,9.4169926508365545E-2,0]
["Q145","CAD",3.8734999999999999,3.8734999999999999,0.9990199365537874,0.9990199365537874]
["Q145","USD",3.7559999999999998E-3,3.7559999999999998E-3,9.6871534315116188E-4,9.6871534315116188E-4,0]
["Q30","CAD",97.042900000000003,97.042900000000003,0.66315894496368932,0.66315894496368932]
["Q30","EUR",10.231096000000001,10.231096000000001,6.9915911717211898E-2,6.9915911717211898E-2,0]
["Q30","USD",39.060329000000003,39.060329000000003,0.26692531416079485,0.26692531416079485,0]
["Q31","AUD",-9.9999999999999995E-7,-9.9999999999999995E-7,-6.9716678390688077E-9,-6.9716678390688077E-9,0]
["Q31","BRL",7.9999999999999996E-6,7.9999999999999996E-6,5.5773342712550462E-8,5.5773342712550462E-8,0]
["Q31","CAD",6.1318000000000001,6.1318000000000001,4.2748872855602117E-2,4.2748872855602117E-2]
["Q31","CHF",2.773361,2.773361,1.9334951689827708E-2,1.9334951689827708E-2,0]
["Q31","EUR",23.298928,23.298928,0.16243238702237975,0.16243238702237975,0]
["Q31","GBP",21.474336000000001,21.474336000000001,0.14971193765655752,0.14971193765655752,0]
["Q31","ILS",2.1606640000000001,2.1606640000000001,1.5063431719833769E-2,1.5063431719833769E-2,0]
["Q31","JPY",2.4357139999999999,2.4357139999999999,1.6980988958969642E-2,1.6980988958969642E-2,0]
["Q31","KOR",2.662658,2.662658,1.8563167145039274E-2,1.8563167145039274E-2,0]
["Q31","NOK",3.0000000000000001E-6,3.0000000000000001E-6,2.0915003517206424E-8,2.0915003517206424E-8,0]
["Q31","SEK",2.8564590000000001,2.8564590000000001,1.9914283343918648E-2,1.9914283343918648E-2,0]
["Q31","TRL",0.65549299999999999,0.65549299999999999,4.5698794668347304E-3,4.5698794668347304E-3,0]
["Q31","USD",78.988304999999997,78.988304999999997,0.5506802256310579,0.5506802256310579,0]
["Q46","AUD",1.6611100000000001,1.6611100000000001,5.6737886614400225E-3,5.6737886614400225E-3,0]
["Q46","CAD",187.53272599112887,187.53272599112887,0.64054822039323434,0.64054822039323434]
["Q46","CHF",3.0932520000000001,3.0932520000000001,1.0565500252588133E-2,1.0565500252588133E-2,0]
["Q46","EUR",11.402188813516979,11.402188813516979,3.8946011766668613E-2,3.8946011766668613E-2,0]
["Q46","GBP",13.592625413779302,13.592625413779302,4.6427800658537056E-2,4.6427800658537056E-2,0]
["Q46","HKD",1.121847,1.121847,3.8318490578411451E-3,3.8318490578411451E-3,0]
["Q46","ILS",1.274262,1.274262,4.3524470307829619E-3,4.3524470307829619E-3,0]
["Q46","JPY",3.8250679999999999,3.8250679999999999,1.3065135630775241E-2,1.3065135630775241E-2,0]
["Q46","KOR",0.90654800000000002,0.90654800000000002,3.0964606579041301E-3,3.0964606579041301E-3,0]
["Q46","SEK",0.96089999999999998,0.96089999999999998,3.2821086651562614E-3,3.2821086651562614E-3,0]
["Q46","SGD",1.3331630000000001,1.3331630000000001,4.5536328799726479E-3,4.5536328799726479E-3,0]
["Q46","THB",0.79141600000000001,0.79141600000000001,2.7032087744232572E-3,2.7032087744232572E-3,0]
["Q46","USD",65.273969327866482,65.273969327866482,0.22295375204509793,0.22295375204509793,0]
["Q47","CAD",101.5994865749977,101.5994865749977,0.92894866046935642,0.92894866046935642]
["Q47","USD",7.7708253630556747,7.7708253630556747,7.1050534358982634E-2,7.1050534358982634E-2,0]
["Q48","CAD",0.13120000000000001,0.13120000000000001,7.6911352631517252E-4,7.6911352631517252E-4]
["Q48","USD",170.4548264,170.4548264,0.99923104123433337,0.99923104123433337,0]
["Q49","AUD",1.0154190000000001,1.0154190000000001,2.2565669001564502E-2,2.2565669001564502E-2,0]
["Q49","CAD",0.61360000000000003,0.61360000000000003,1.3636040392547292E-2,1.3636040392547292E-2]
["Q49","CHF",4.7508290000000004,4.7508290000000004,0.10557773165268099,0.10557773165268099,0]
["Q49","EUR",14.747367000000001,14.747367000000001,0.32773091932157589,0.32773091932157589,0]
["Q49","GBP",9.5204649999999997,9.5204649999999997,0.21157341149907552,0.21157341149907552,0]
["Q49","HKD",2.0903360000000002,2.0903360000000002,4.6453562793343769E-2,4.6453562793343769E-2,0]
["Q49","JPY",8.8452582599999996,8.8452582599999996,0.19656828376120039,0.19656828376120039,0]
["Q49","KOR",0.872807,0.872807,1.9396400760915943E-2,1.9396400760915943E-2,0]
["Q49","NZD",2.5599999999999999E-4,2.5599999999999999E-4,5.6890911676859621E-6,5.6890911676859621E-6,0]
["Q49","SEK",0.87271900000000002,0.87271900000000002,1.9394445135827051E-2,1.9394445135827051E-2,0]
["Q49","SGD",-3.3515000000000003E-2,-3.3515000000000003E-2,-7.4480425970701192E-4,-7.4480425970701192E-4,0]
["Q49","USD",1.702874,1.702874,3.7842989972976818E-2,3.7842989972976818E-2,0]
["Q82","CAD",6.2377000000000002,6.2377000000000002,1,1]
["Q85","CAD",30.417139927387019,30.556672627187638,0.54996311406365528,0.55248596263782257]
["Q85","USD",23.629020941068667,23.489488551419036,0.42722918624327699,0.42470634327685591,5.9051278509434368E-3]
["Q85","CHF",0.31566759613300022,0.31566759613300022,5.7074904015542204E-3,5.7074904015542204E-3,0]
["Q85","EUR",0.33537150106814972,0.33537150106814972,6.063750751581152E-3,6.063750751581152E-3,0]
["Q85","GBP",7.1297186993502903E-2,7.1297186993502903E-2,1.2891028899012595E-3,1.2891028899012595E-3,0]
["Q85","HKD",0.21583065567763962,0.21583065567763962,3.9023688548705717E-3,3.9023688548705717E-3,0]
["Q85","AUD",1.494769102547478E-4,1.494769102547478E-4,2.7026468379526107E-6,2.7026468379526107E-6,0]
["Q85","JPY",0.1860994089539752,0.1860994089539752,3.3648071685261193E-3,3.3648071685261193E-3,0]
["Q85","KOR",0.1370289354677485,0.1370289354677485,2.4775787679767068E-3,2.4775787679767068E-3,0]
["Q88","CAD",228.82159999999999,228.82159999999999,1,1]
["Q89","CAD",0.4824,0.2722,9.7594134641062358E-3,5.5068663866702271E-3]
["Q89","EUR",0.43885000000000002,4.0448580000000019E-2,8.8783553041522027E-3,8.1831346653395197E-4,0.90783051156431582]
["Q89","GBP",0.493647,-0.63226349999999998,9.9869510329926442E-3,-1.2791295428613045E-2,2.2808008556721706]
["Q89","USD",48.014301099999997,49.748732439999998,0.97137524175993128,1.0064644469261084,-3.6123223711778563E-2]
["Q94","AUD",8.0465979999999995,8.0465979999999995,4.0257869363266495E-2,4.0257869363266495E-2,0]
["Q94","CAD",3.3283,3.3283,1.6651790806718553E-2,1.6651790806718553E-2]
["Q94","CHF",9.5377829999999992,9.5377829999999992,4.7718404974274098E-2,4.7718404974274098E-2,0]
["Q94","EUR",60.124966829999998,60.124966829999998,0.30081073518434392,0.30081073518434392,0]
["Q94","GBP",38.019007289999998,38.019007289999998,0.1902125878292785,0.1902125878292785,0]
["Q94","HKD",3.6441370000000002,3.6441370000000002,1.823195234655017E-2,1.823195234655017E-2,0]
["Q94","KOR",9.3436620000000001,9.3436620000000001,4.6747199769457529E-2,4.6747199769457529E-2,0]
["Q94","NOK",3.9909479999999999,3.9909479999999999,1.996707965522693E-2,1.996707965522693E-2,0]
["Q94","SEK",15.379523000000001,15.379523000000001,7.6945167113276008E-2,7.6945167113276008E-2,0]
["Q94","SGD",6.0000000000000002E-6,6.0000000000000002E-6,3.0018551464805252E-8,3.0018551464805252E-8,0]
["Q94","USD",48.461459429999998,48.461459429999998,0.24245713565983776,0.24245713565983776,0]

{"sheet":"ChartPrep","index":5,"n_rows":43,"n_cols":15,"rows_kept":43,"cut":false,"hidden":true,"merged":[[1,13,1,14],[1,4,1,11]]}
[]
[null,null,null,null,"fund's unique currency exposures\n(unsorted)",null,null,null,null,null,null,null,null,"chart\nformulae"]
[null,null,null,null,"#","include","r","code","currency","gross","net","i",null,"Step","MaxMin"]
[null,"data as of","2019-10-31",null,1,{"$f":"NOT(E4>nCurrencyExposures)","v":true},{"$f":"MATCH(PresentedFundMPowerCode,OFFSET(tData,0,0,,1),0)","v":1429},{"$f":"IF($F4,INDEX(tData,$G4,2),\"\")","v":"CAD"},{"$f":"IF($F4,INDEX(tCurrencyNamesEN,MATCH($H4,tCurrencyCodes,0),1),\"\")","v":"Canada Dollar"},{"$f":"IF($F4,INDEX(tData,$G4,5),\"\")","v":1.4599090914578568E-2},{"$f":"IF($F4,INDEX(tData,$G4,6),\"\")","v":1.4599090914578568E-2},{"$f":"IF($F4,RANK(K4,OFFSET(K$4,0,0,nCurrencyExposures,1),1)-ROW(K4)/100,\"\")","v":0.96},null,{"$f":"nCurrencyExposures-0.5","v":3.5},{"$f":"MAX(vGrossExposures,vNetExposures)","v":0.65918040456112181}]
[null,"index of fund selected",1,null,{"$f":"E4+1","v":2},true,{"$f":"IF($F5,G4+1,\"\")","v":1430},"CNY","China Yuan Renminbi",0.65918040456112181,0.65918040456112181,3.95,null,{"$f":"IF($F5,N4-1,\"\")","v":2.5},{"$f":"MIN(vGrossExposures,vNetExposures)","v":1.4599090914578568E-2}]
[null,"MPower fund code of fund selected",{"$f":"INDEX(tMPowerFundCodes,MATCH(SelectedFundNameEN,tAllRetailFundsEN,0),1)","v":"5299"},null,3,true,1431,"HKD","Hong Kong Dollar",0.24427049818605465,0.24427049818605465,2.94,null,1.5,{"$f":"IF($F6,O5,\"\")","v":1.4599090914578568E-2}]
[null,"# of unique currency exposures this fund has",{"$f":"COUNTIF(OFFSET(tData,0,0,,1),PresentedFundMPowerCode)","v":4},null,4,true,1432,"USD","United States Dollar",8.1949402695866869E-2,8.1949402695866869E-2,1.93,null,0.5,1.4599090914578568E-2]
[null,null,null,null,5,false,"","","","","","",null,"",""]
[null,"Update 'Tables' tab with Name changes, Launches, & Terminations.",null,null,6,false,"","","","","","",null,"",""]
[null,null,null,null,7,false,"","","","","","",null,"",""]
[null,"When adding or removing funds from \\Tables/, Columns D:F, ",null,null,8,false,"","","","","","",null,"",""]
[null,"Ensure the following Formula Names are adjusted to match the new ",null,null,9,false,"","","","","","",null,"",""]
[null,"    number of rows:",null,null,10,false,"","","","","","",null,"",""]
[null,"    - tMPowerFundCodes",null,null,11,false,"","","","","","",null,"",""]
[null,"    - tAllRetailFundsEN",null,null,12,false,"","","","","","",null,"",""]
[null,"    - tAllRetailFundsFR",null,null,13,false,"","","","","","",null,"",""]
[null,null,null,null,14,false,"","","","","","",null,"",""]
[null,null,null,null,15,false,"","","","","","",null,"",""]
[null,null,null,null,16,false,"","","","","","",null,"",""]
[null,null,null,null,17,false,"","","","","","",null,"",""]
[null,null,null,null,18,false,"","","","","","",null,"",""]
[null,null,null,null,19,false,"","","","","","",null,"",""]
[null,null,null,null,20,false,"","","","","","",null,"",""]
[null,null,null,null,21,false,"","","","","","",null,"",""]
[null,null,null,null,22,false,"","","","","","",null,"",""]
[null,null,null,null,23,false,"","","","","","",null,"",""]
[null,null,null,null,24,false,"","","","","","",null,"",""]
[null,null,null,null,25,false,"","","","","","",null,"",""]
[null,null,null,null,26,false,"","","","","","",null,"",""]
[null,"Copy 'Data' tab to a new file, and provide it to Vincent So.",null,null,27,false,"","","","","","",null,"",""]
[null,null,null,null,28,false,"","","","","","",null,"",""]
[null,null,null,null,29,false,"","","","","","",null,"",""]
[null,null,null,null,30,false,"","","","","","",null,"",""]
[null,null,null,null,31,false,"","","","","","",null,"",""]
[null,"File must be named \"Currency_Exposure_Report.xlsm\"",null,null,32,false,"","","","","","",null,"",""]
[null," to be loaded to the website.",null,null,33,false,"","","","","","",null,"",""]
[null,null,null,null,34,false,"","","","","","",null,"",""]
[null,null,null,null,35,false,"","","","","","",null,"",""]
[null,null,null,null,36,false,"","","","","","",null,"",""]
[null,null,null,null,37,false,"","","","","","",null,"",""]
[null,null,null,null,38,false,"","","","","","",null,"",""]
[null,null,null,null,39,false,"","","","","","",null,"",""]
[null,null,null,null,40,false,"","","","","","",null,"",""]

{"sheet":"Table_EN","index":8,"n_rows":43,"n_cols":5,"rows_kept":43,"cut":false,"hidden":false,"merged":[]}
[null,null,{"$f":"INDEX(tFundsWithExposuresEN,ChartPrep!C5)","v":"Mackenzie All China Equity Fund"}]
[null,null,{"$f":"\"as of \" & TEXT(ChartPrep!C4,\"mmmm d,yyyy\")","v":"as of October 31,2019"}]
["i",null,"currency","gross currency exposure from portfolio investments","net currency exposure after any hedging"]
[{"$f":"IF(ChartPrep!$F4,LARGE(OFFSET(ChartPrep!$L$4,0,0,nCurrencyExposures,1),ChartPrep!E4),\"\")","v":3.95},null,{"$f":"IF(ChartPrep!$F4,INDEX(ChartPrep!I$4:I$43,MATCH($A4,ChartPrep!$L$4:$L$43,0)),\"\")","v":"China Yuan Renminbi"},{"$f":"IF(ChartPrep!$F4,INDEX(ChartPrep!J$4:J$43,MATCH($A4,ChartPrep!$L$4:$L$43,0)),\"\")","v":0.65918040456112181},{"$f":"IF(ChartPrep!$F4,INDEX(ChartPrep!K$4:K$43,MATCH($A4,ChartPrep!$L$4:$L$43,0)),\"\")","v":0.65918040456112181}]
[{"$f":"IF(ChartPrep!$F5,LARGE(OFFSET(ChartPrep!$L$4,0,0,nCurrencyExposures,1),ChartPrep!E5),\"\")","v":2.94},null,{"$f":"IF(ChartPrep!$F5,INDEX(ChartPrep!I$4:I$43,MATCH($A5,ChartPrep!$L$4:$L$43,0)),\"\")","v":"Hong Kong Dollar"},{"$f":"IF(ChartPrep!$F5,INDEX(ChartPrep!J$4:J$43,MATCH($A5,ChartPrep!$L$4:$L$43,0)),\"\")","v":0.24427049818605465},{"$f":"IF(ChartPrep!$F5,INDEX(ChartPrep!K$4:K$43,MATCH($A5,ChartPrep!$L$4:$L$43,0)),\"\")","v":0.24427049818605465}]
[{"$f":"IF(ChartPrep!$F6,LARGE(OFFSET(ChartPrep!$L$4,0,0,nCurrencyExposures,1),ChartPrep!E6),\"\")","v":1.93},null,{"$f":"IF(ChartPrep!$F6,INDEX(ChartPrep!I$4:I$43,MATCH($A6,ChartPrep!$L$4:$L$43,0)),\"\")","v":"United States Dollar"},{"$f":"IF(ChartPrep!$F6,INDEX(ChartPrep!J$4:J$43,MATCH($A6,ChartPrep!$L$4:$L$43,0)),\"\")","v":8.1949402695866869E-2},{"$f":"IF(ChartPrep!$F6,INDEX(ChartPrep!K$4:K$43,MATCH($A6,ChartPrep!$L$4:$L$43,0)),\"\")","v":8.1949402695866869E-2}]
[{"$f":"IF(ChartPrep!$F7,LARGE(OFFSET(ChartPrep!$L$4,0,0,nCurrencyExposures,1),ChartPrep!E7),\"\")","v":0.96},null,{"$f":"IF(ChartPrep!$F7,INDEX(ChartPrep!I$4:I$43,MATCH($A7,ChartPrep!$L$4:$L$43,0)),\"\")","v":"Canada Dollar"},{"$f":"IF(ChartPrep!$F7,INDEX(ChartPrep!J$4:J$43,MATCH($A7,ChartPrep!$L$4:$L$43,0)),\"\")","v":1.4599090914578568E-2},{"$f":"IF(ChartPrep!$F7,INDEX(ChartPrep!K$4:K$43,MATCH($A7,ChartPrep!$L$4:$L$43,0)),\"\")","v":1.4599090914578568E-2}]
[{"$f":"IF(ChartPrep!$F8,LARGE(OFFSET(ChartPrep!$L$4,0,0,nCurrencyExposures,1),ChartPrep!E8),\"\")","v":""},null,{"$f":"IF(ChartPrep!$F8,INDEX(ChartPrep!I$4:I$43,MATCH($A8,ChartPrep!$L$4:$L$43,0)),\"\")","v":""},{"$f":"IF(ChartPrep!$F8,INDEX(ChartPrep!J$4:J$43,MATCH($A8,ChartPrep!$L$4:$L$43,0)),\"\")","v":""},{"$f":"IF(ChartPrep!$F8,INDEX(ChartPrep!K$4:K$43,MATCH($A8,ChartPrep!$L$4:$L$43,0)),\"\")","v":""}]
[{"$f":"IF(ChartPrep!$F9,LARGE(OFFSET(ChartPrep!$L$4,0,0,nCurrencyExposures,1),ChartPrep!E9),\"\")","v":""},null,{"$f":"IF(ChartPrep!$F9,INDEX(ChartPrep!I$4:I$43,MATCH($A9,ChartPrep!$L$4:$L$43,0)),\"\")","v":""},{"$f":"IF(ChartPrep!$F9,INDEX(ChartPrep!J$4:J$43,MATCH($A9,ChartPrep!$L$4:$L$43,0)),\"\")","v":""},{"$f":"IF(ChartPrep!$F9,INDEX(ChartPrep!K$4:K$43,MATCH($A9,ChartPrep!$L$4:$L$43,0)),\"\")","v":""}]
[{"$f":"IF(ChartPrep!$F10,LARGE(OFFSET(ChartPrep!$L$4,0,0,nCurrencyExposures,1),ChartPrep!E10),\"\")","v":""},null,{"$f":"IF(ChartPrep!$F10,INDEX(ChartPrep!I$4:I$43,MATCH($A10,ChartPrep!$L$4:$L$43,0)),\"\")","v":""},{"$f":"IF(ChartPrep!$F10,INDEX(ChartPrep!J$4:J$43,MATCH($A10,ChartPrep!$L$4:$L$43,0)),\"\")","v":""},{"$f":"IF(ChartPrep!$F10,INDEX(ChartPrep!K$4:K$43,MATCH($A10,ChartPrep!$L$4:$L$43,0)),\"\")","v":""}]
[{"$f":"IF(ChartPrep!$F11,LARGE(OFFSET(ChartPrep!$L$4,0,0,nCurrencyExposures,1),ChartPrep!E11),\"\")","v":""},null,{"$f":"IF(ChartPrep!$F11,INDEX(ChartPrep!I$4:I$43,MATCH($A11,ChartPrep!$L$4:$L$43,0)),\"\")","v":""},{"$f":"IF(ChartPrep!$F11,INDEX(ChartPrep!J$4:J$43,MATCH($A11,ChartPrep!$L$4:$L$43,0)),\"\")","v":""},{"$f":"IF(ChartPrep!$F11,INDEX(ChartPrep!K$4:K$43,MATCH($A11,ChartPrep!$L$4:$L$43,0)),\"\")","v":""}]
[{"$f":"IF(ChartPrep!$F12,LARGE(OFFSET(ChartPrep!$L$4,0,0,nCurrencyExposures,1),ChartPrep!E12),\"\")","v":""},null,{"$f":"IF(ChartPrep!$F12,INDEX(ChartPrep!I$4:I$43,MATCH($A12,ChartPrep!$L$4:$L$43,0)),\"\")","v":""},{"$f":"IF(ChartPrep!$F12,INDEX(ChartPrep!J$4:J$43,MATCH($A12,ChartPrep!$L$4:$L$43,0)),\"\")","v":""},{"$f":"IF(ChartPrep!$F12,INDEX(ChartPrep!K$4:K$43,MATCH($A12,ChartPrep!$L$4:$L$43,0)),\"\")","v":""}]
[{"$f":"IF(ChartPrep!$F13,LARGE(OFFSET(ChartPrep!$L$4,0,0,nCurrencyExposures,1),ChartPrep!E13),\"\")","v":""},null,{"$f":"IF(ChartPrep!$F13,INDEX(ChartPrep!I$4:I$43,MATCH($A13,ChartPrep!$L$4:$L$43,0)),\"\")","v":""},{"$f":"IF(ChartPrep!$F13,INDEX(ChartPrep!J$4:J$43,MATCH($A13,ChartPrep!$L$4:$L$43,0)),\"\")","v":""},{"$f":"IF(ChartPrep!$F13,INDEX(ChartPrep!K$4:K$43,MATCH($A13,ChartPrep!$L$4:$L$43,0)),\"\")","v":""}]
[{"$f":"IF(ChartPrep!$F14,LARGE(OFFSET(ChartPrep!$L$4,0,0,nCurrencyExposures,1),ChartPrep!E14),\"\")","v":""},null,{"$f":"IF(ChartPrep!$F14,INDEX(ChartPrep!I$4:I$43,MATCH($A14,ChartPrep!$L$4:$L$43,0)),\"\")","v":""},{"$f":"IF(ChartPrep!$F14,INDEX(ChartPrep!J$4:J$43,MATCH($A14,ChartPrep!$L$4:$L$43,0)),\"\")","v":""},{"$f":"IF(ChartPrep!$F14,INDEX(ChartPrep!K$4:K$43,MATCH($A14,ChartPrep!$L$4:$L$43,0)),\"\")","v":""}]
[{"$f":"IF(ChartPrep!$F15,LARGE(OFFSET(ChartPrep!$L$4,0,0,nCurrencyExposures,1),ChartPrep!E15),\"\")","v":""},null,{"$f":"IF(ChartPrep!$F15,INDEX(ChartPrep!I$4:I$43,MATCH($A15,ChartPrep!$L$4:$L$43,0)),\"\")","v":""},{"$f":"IF(ChartPrep!$F15,INDEX(ChartPrep!J$4:J$43,MATCH($A15,ChartPrep!$L$4:$L$43,0)),\"\")","v":""},{"$f":"IF(ChartPrep!$F15,INDEX(ChartPrep!K$4:K$43,MATCH($A15,ChartPrep!$L$4:$L$43,0)),\"\")","v":""}]
[{"$f":"IF(ChartPrep!$F16,LARGE(OFFSET(ChartPrep!$L$4,0,0,nCurrencyExposures,1),ChartPrep!E16),\"\")","v":""},null,{"$f":"IF(ChartPrep!$F16,INDEX(ChartPrep!I$4:I$43,MATCH($A16,ChartPrep!$L$4:$L$43,0)),\"\")","v":""},{"$f":"IF(ChartPrep!$F16,INDEX(ChartPrep!J$4:J$43,MATCH($A16,ChartPrep!$L$4:$L$43,0)),\"\")","v":""},{"$f":"IF(ChartPrep!$F16,INDEX(ChartPrep!K$4:K$43,MATCH($A16,ChartPrep!$L$4:$L$43,0)),\"\")","v":""}]
[{"$f":"IF(ChartPrep!$F17,LARGE(OFFSET(ChartPrep!$L$4,0,0,nCurrencyExposures,1),ChartPrep!E17),\"\")","v":""},null,{"$f":"IF(ChartPrep!$F17,INDEX(ChartPrep!I$4:I$43,MATCH($A17,ChartPrep!$L$4:$L$43,0)),\"\")","v":""},{"$f":"IF(ChartPrep!$F17,INDEX(ChartPrep!J$4:J$43,MATCH($A17,ChartPrep!$L$4:$L$43,0)),\"\")","v":""},{"$f":"IF(ChartPrep!$F17,INDEX(ChartPrep!K$4:K$43,MATCH($A17,ChartPrep!$L$4:$L$43,0)),\"\")","v":""}]
[{"$f":"IF(ChartPrep!$F18,LARGE(OFFSET(ChartPrep!$L$4,0,0,nCurrencyExposures,1),ChartPrep!E18),\"\")","v":""},null,{"$f":"IF(ChartPrep!$F18,INDEX(ChartPrep!I$4:I$43,MATCH($A18,ChartPrep!$L$4:$L$43,0)),\"\")","v":""},{"$f":"IF(ChartPrep!$F18,INDEX(ChartPrep!J$4:J$43,MATCH($A18,ChartPrep!$L$4:$L$43,0)),\"\")","v":""},{"$f":"IF(ChartPrep!$F18,INDEX(ChartPrep!K$4:K$43,MATCH($A18,ChartPrep!$L$4:$L$43,0)),\"\")","v":""}]
[{"$f":"IF(ChartPrep!$F19,LARGE(OFFSET(ChartPrep!$L$4,0,0,nCurrencyExposures,1),ChartPrep!E19),\"\")","v":""},null,{"$f":"IF(ChartPrep!$F19,INDEX(ChartPrep!I$4:I$43,MATCH($A19,ChartPrep!$L$4:$L$43,0)),\"\")","v":""},{"$f":"IF(ChartPrep!$F19,INDEX(ChartPrep!J$4:J$43,MATCH($A19,ChartPrep!$L$4:$L$43,0)),\"\")","v":""},{"$f":"IF(ChartPrep!$F19,INDEX(ChartPrep!K$4:K$43,MATCH($A19,ChartPrep!$L$4:$L$43,0)),\"\")","v":""}]
[{"$f":"IF(ChartPrep!$F20,LARGE(OFFSET(ChartPrep!$L$4,0,0,nCurrencyExposures,1),ChartPrep!E20),\"\")","v":""},null,{"$f":"IF(ChartPrep!$F20,INDEX(ChartPrep!I$4:I$43,MATCH($A20,ChartPrep!$L$4:$L$43,0)),\"\")","v":""},{"$f":"IF(ChartPrep!$F20,INDEX(ChartPrep!J$4:J$43,MATCH($A20,ChartPrep!$L$4:$L$43,0)),\"\")","v":""},{"$f":"IF(ChartPrep!$F20,INDEX(ChartPrep!K$4:K$43,MATCH($A20,ChartPrep!$L$4:$L$43,0)),\"\")","v":""}]
[{"$f":"IF(ChartPrep!$F21,LARGE(OFFSET(ChartPrep!$L$4,0,0,nCurrencyExposures,1),ChartPrep!E21),\"\")","v":""},null,{"$f":"IF(ChartPrep!$F21,INDEX(ChartPrep!I$4:I$43,MATCH($A21,ChartPrep!$L$4:$L$43,0)),\"\")","v":""},{"$f":"IF(ChartPrep!$F21,INDEX(ChartPrep!J$4:J$43,MATCH($A21,ChartPrep!$L$4:$L$43,0)),\"\")","v":""},{"$f":"IF(ChartPrep!$F21,INDEX(ChartPrep!K$4:K$43,MATCH($A21,ChartPrep!$L$4:$L$43,0)),\"\")","v":""}]
[{"$f":"IF(ChartPrep!$F22,LARGE(OFFSET(ChartPrep!$L$4,0,0,nCurrencyExposures,1),ChartPrep!E22),\"\")","v":""},null,{"$f":"IF(ChartPrep!$F22,INDEX(ChartPrep!I$4:I$43,MATCH($A22,ChartPrep!$L$4:$L$43,0)),\"\")","v":""},{"$f":"IF(ChartPrep!$F22,INDEX(ChartPrep!J$4:J$43,MATCH($A22,ChartPrep!$L$4:$L$43,0)),\"\")","v":""},{"$f":"IF(ChartPrep!$F22,INDEX(ChartPrep!K$4:K$43,MATCH($A22,ChartPrep!$L$4:$L$43,0)),\"\")","v":""}]
[{"$f":"IF(ChartPrep!$F23,LARGE(OFFSET(ChartPrep!$L$4,0,0,nCurrencyExposures,1),ChartPrep!E23),\"\")","v":""},null,{"$f":"IF(ChartPrep!$F23,INDEX(ChartPrep!I$4:I$43,MATCH($A23,ChartPrep!$L$4:$L$43,0)),\"\")","v":""},{"$f":"IF(ChartPrep!$F23,INDEX(ChartPrep!J$4:J$43,MATCH($A23,ChartPrep!$L$4:$L$43,0)),\"\")","v":""},{"$f":"IF(ChartPrep!$F23,INDEX(ChartPrep!K$4:K$43,MATCH($A23,ChartPrep!$L$4:$L$43,0)),\"\")","v":""}]
[{"$f":"IF(ChartPrep!$F24,LARGE(OFFSET(ChartPrep!$L$4,0,0,nCurrencyExposures,1),ChartPrep!E24),\"\")","v":""},null,{"$f":"IF(ChartPrep!$F24,INDEX(ChartPrep!I$4:I$43,MATCH($A24,ChartPrep!$L$4:$L$43,0)),\"\")","v":""},{"$f":"IF(ChartPrep!$F24,INDEX(ChartPrep!J$4:J$43,MATCH($A24,ChartPrep!$L$4:$L$43,0)),\"\")","v":""},{"$f":"IF(ChartPrep!$F24,INDEX(ChartPrep!K$4:K$43,MATCH($A24,ChartPrep!$L$4:$L$43,0)),\"\")","v":""}]
[{"$f":"IF(ChartPrep!$F25,LARGE(OFFSET(ChartPrep!$L$4,0,0,nCurrencyExposures,1),ChartPrep!E25),\"\")","v":""},null,{"$f":"IF(ChartPrep!$F25,INDEX(ChartPrep!I$4:I$43,MATCH($A25,ChartPrep!$L$4:$L$43,0)),\"\")","v":""},{"$f":"IF(ChartPrep!$F25,INDEX(ChartPrep!J$4:J$43,MATCH($A25,ChartPrep!$L$4:$L$43,0)),\"\")","v":""},{"$f":"IF(ChartPrep!$F25,INDEX(ChartPrep!K$4:K$43,MATCH($A25,ChartPrep!$L$4:$L$43,0)),\"\")","v":""}]
[{"$f":"IF(ChartPrep!$F26,LARGE(OFFSET(ChartPrep!$L$4,0,0,nCurrencyExposures,1),ChartPrep!E26),\"\")","v":""},null,{"$f":"IF(ChartPrep!$F26,INDEX(ChartPrep!I$4:I$43,MATCH($A26,ChartPrep!$L$4:$L$43,0)),\"\")","v":""},{"$f":"IF(ChartPrep!$F26,INDEX(ChartPrep!J$4:J$43,MATCH($A26,ChartPrep!$L$4:$L$43,0)),\"\")","v":""},{"$f":"IF(ChartPrep!$F26,INDEX(ChartPrep!K$4:K$43,MATCH($A26,ChartPrep!$L$4:$L$43,0)),\"\")","v":""}]
[{"$f":"IF(ChartPrep!$F27,LARGE(OFFSET(ChartPrep!$L$4,0,0,nCurrencyExposures,1),ChartPrep!E27),\"\")","v":""},null,{"$f":"IF(ChartPrep!$F27,INDEX(ChartPrep!I$4:I$43,MATCH($A27,ChartPrep!$L$4:$L$43,0)),\"\")","v":""},{"$f":"IF(ChartPrep!$F27,INDEX(ChartPrep!J$4:J$43,MATCH($A27,ChartPrep!$L$4:$L$43,0)),\"\")","v":""},{"$f":"IF(ChartPrep!$F27,INDEX(ChartPrep!K$4:K$43,MATCH($A27,ChartPrep!$L$4:$L$43,0)),\"\")","v":""}]
[{"$f":"IF(ChartPrep!$F28,LARGE(OFFSET(ChartPrep!$L$4,0,0,nCurrencyExposures,1),ChartPrep!E28),\"\")","v":""},null,{"$f":"IF(ChartPrep!$F28,INDEX(ChartPrep!I$4:I$43,MATCH($A28,ChartPrep!$L$4:$L$43,0)),\"\")","v":""},{"$f":"IF(ChartPrep!$F28,INDEX(ChartPrep!J$4:J$43,MATCH($A28,ChartPrep!$L$4:$L$43,0)),\"\")","v":""},{"$f":"IF(ChartPrep!$F28,INDEX(ChartPrep!K$4:K$43,MATCH($A28,ChartPrep!$L$4:$L$43,0)),\"\")","v":""}]
[{"$f":"IF(ChartPrep!$F29,LARGE(OFFSET(ChartPrep!$L$4,0,0,nCurrencyExposures,1),ChartPrep!E29),\"\")","v":""},null,{"$f":"IF(ChartPrep!$F29,INDEX(ChartPrep!I$4:I$43,MATCH($A29,ChartPrep!$L$4:$L$43,0)),\"\")","v":""},{"$f":"IF(ChartPrep!$F29,INDEX(ChartPrep!J$4:J$43,MATCH($A29,ChartPrep!$L$4:$L$43,0)),\"\")","v":""},{"$f":"IF(ChartPrep!$F29,INDEX(ChartPrep!K$4:K$43,MATCH($A29,ChartPrep!$L$4:$L$43,0)),\"\")","v":""}]
[{"$f":"IF(ChartPrep!$F30,LARGE(OFFSET(ChartPrep!$L$4,0,0,nCurrencyExposures,1),ChartPrep!E30),\"\")","v":""},null,{"$f":"IF(ChartPrep!$F30,INDEX(ChartPrep!I$4:I$43,MATCH($A30,ChartPrep!$L$4:$L$43,0)),\"\")","v":""},{"$f":"IF(ChartPrep!$F30,INDEX(ChartPrep!J$4:J$43,MATCH($A30,ChartPrep!$L$4:$L$43,0)),\"\")","v":""},{"$f":"IF(ChartPrep!$F30,INDEX(ChartPrep!K$4:K$43,MATCH($A30,ChartPrep!$L$4:$L$43,0)),\"\")","v":""}]
[{"$f":"IF(ChartPrep!$F31,LARGE(OFFSET(ChartPrep!$L$4,0,0,nCurrencyExposures,1),ChartPrep!E31),\"\")","v":""},null,{"$f":"IF(ChartPrep!$F31,INDEX(ChartPrep!I$4:I$43,MATCH($A31,ChartPrep!$L$4:$L$43,0)),\"\")","v":""},{"$f":"IF(ChartPrep!$F31,INDEX(ChartPrep!J$4:J$43,MATCH($A31,ChartPrep!$L$4:$L$43,0)),\"\")","v":""},{"$f":"IF(ChartPrep!$F31,INDEX(ChartPrep!K$4:K$43,MATCH($A31,ChartPrep!$L$4:$L$43,0)),\"\")","v":""}]
[{"$f":"IF(ChartPrep!$F32,LARGE(OFFSET(ChartPrep!$L$4,0,0,nCurrencyExposures,1),ChartPrep!E32),\"\")","v":""},null,{"$f":"IF(ChartPrep!$F32,INDEX(ChartPrep!I$4:I$43,MATCH($A32,ChartPrep!$L$4:$L$43,0)),\"\")","v":""},{"$f":"IF(ChartPrep!$F32,INDEX(ChartPrep!J$4:J$43,MATCH($A32,ChartPrep!$L$4:$L$43,0)),\"\")","v":""},{"$f":"IF(ChartPrep!$F32,INDEX(ChartPrep!K$4:K$43,MATCH($A32,ChartPrep!$L$4:$L$43,0)),\"\")","v":""}]
[{"$f":"IF(ChartPrep!$F33,LARGE(OFFSET(ChartPrep!$L$4,0,0,nCurrencyExposures,1),ChartPrep!E33),\"\")","v":""},null,{"$f":"IF(ChartPrep!$F33,INDEX(ChartPrep!I$4:I$43,MATCH($A33,ChartPrep!$L$4:$L$43,0)),\"\")","v":""},{"$f":"IF(ChartPrep!$F33,INDEX(ChartPrep!J$4:J$43,MATCH($A33,ChartPrep!$L$4:$L$43,0)),\"\")","v":""},{"$f":"IF(ChartPrep!$F33,INDEX(ChartPrep!K$4:K$43,MATCH($A33,ChartPrep!$L$4:$L$43,0)),\"\")","v":""}]
[{"$f":"IF(ChartPrep!$F34,LARGE(OFFSET(ChartPrep!$L$4,0,0,nCurrencyExposures,1),ChartPrep!E34),\"\")","v":""},null,{"$f":"IF(ChartPrep!$F34,INDEX(ChartPrep!I$4:I$43,MATCH($A34,ChartPrep!$L$4:$L$43,0)),\"\")","v":""},{"$f":"IF(ChartPrep!$F34,INDEX(ChartPrep!J$4:J$43,MATCH($A34,ChartPrep!$L$4:$L$43,0)),\"\")","v":""},{"$f":"IF(ChartPrep!$F34,INDEX(ChartPrep!K$4:K$43,MATCH($A34,ChartPrep!$L$4:$L$43,0)),\"\")","v":""}]
[{"$f":"IF(ChartPrep!$F35,LARGE(OFFSET(ChartPrep!$L$4,0,0,nCurrencyExposures,1),ChartPrep!E35),\"\")","v":""},null,{"$f":"IF(ChartPrep!$F35,INDEX(ChartPrep!I$4:I$43,MATCH($A35,ChartPrep!$L$4:$L$43,0)),\"\")","v":""},{"$f":"IF(ChartPrep!$F35,INDEX(ChartPrep!J$4:J$43,MATCH($A35,ChartPrep!$L$4:$L$43,0)),\"\")","v":""},{"$f":"IF(ChartPrep!$F35,INDEX(ChartPrep!K$4:K$43,MATCH($A35,ChartPrep!$L$4:$L$43,0)),\"\")","v":""}]
[{"$f":"IF(ChartPrep!$F36,LARGE(OFFSET(ChartPrep!$L$4,0,0,nCurrencyExposures,1),ChartPrep!E36),\"\")","v":""},null,{"$f":"IF(ChartPrep!$F36,INDEX(ChartPrep!I$4:I$43,MATCH($A36,ChartPrep!$L$4:$L$43,0)),\"\")","v":""},{"$f":"IF(ChartPrep!$F36,INDEX(ChartPrep!J$4:J$43,MATCH($A36,ChartPrep!$L$4:$L$43,0)),\"\")","v":""},{"$f":"IF(ChartPrep!$F36,INDEX(ChartPrep!K$4:K$43,MATCH($A36,ChartPrep!$L$4:$L$43,0)),\"\")","v":""}]
[{"$f":"IF(ChartPrep!$F37,LARGE(OFFSET(ChartPrep!$L$4,0,0,nCurrencyExposures,1),ChartPrep!E37),\"\")","v":""},null,{"$f":"IF(ChartPrep!$F37,INDEX(ChartPrep!I$4:I$43,MATCH($A37,ChartPrep!$L$4:$L$43,0)),\"\")","v":""},{"$f":"IF(ChartPrep!$F37,INDEX(ChartPrep!J$4:J$43,MATCH($A37,ChartPrep!$L$4:$L$43,0)),\"\")","v":""},{"$f":"IF(ChartPrep!$F37,INDEX(ChartPrep!K$4:K$43,MATCH($A37,ChartPrep!$L$4:$L$43,0)),\"\")","v":""}]
[{"$f":"IF(ChartPrep!$F38,LARGE(OFFSET(ChartPrep!$L$4,0,0,nCurrencyExposures,1),ChartPrep!E38),\"\")","v":""},null,{"$f":"IF(ChartPrep!$F38,INDEX(ChartPrep!I$4:I$43,MATCH($A38,ChartPrep!$L$4:$L$43,0)),\"\")","v":""},{"$f":"IF(ChartPrep!$F38,INDEX(ChartPrep!J$4:J$43,MATCH($A38,ChartPrep!$L$4:$L$43,0)),\"\")","v":""},{"$f":"IF(ChartPrep!$F38,INDEX(ChartPrep!K$4:K$43,MATCH($A38,ChartPrep!$L$4:$L$43,0)),\"\")","v":""}]
[{"$f":"IF(ChartPrep!$F39,LARGE(OFFSET(ChartPrep!$L$4,0,0,nCurrencyExposures,1),ChartPrep!E39),\"\")","v":""},null,{"$f":"IF(ChartPrep!$F39,INDEX(ChartPrep!I$4:I$43,MATCH($A39,ChartPrep!$L$4:$L$43,0)),\"\")","v":""},{"$f":"IF(ChartPrep!$F39,INDEX(ChartPrep!J$4:J$43,MATCH($A39,ChartPrep!$L$4:$L$43,0)),\"\")","v":""},{"$f":"IF(ChartPrep!$F39,INDEX(ChartPrep!K$4:K$43,MATCH($A39,ChartPrep!$L$4:$L$43,0)),\"\")","v":""}]
[{"$f":"IF(ChartPrep!$F40,LARGE(OFFSET(ChartPrep!$L$4,0,0,nCurrencyExposures,1),ChartPrep!E40),\"\")","v":""},null,{"$f":"IF(ChartPrep!$F40,INDEX(ChartPrep!I$4:I$43,MATCH($A40,ChartPrep!$L$4:$L$43,0)),\"\")","v":""},{"$f":"IF(ChartPrep!$F40,INDEX(ChartPrep!J$4:J$43,MATCH($A40,ChartPrep!$L$4:$L$43,0)),\"\")","v":""},{"$f":"IF(ChartPrep!$F40,INDEX(ChartPrep!K$4:K$43,MATCH($A40,ChartPrep!$L$4:$L$43,0)),\"\")","v":""}]
[{"$f":"IF(ChartPrep!$F41,LARGE(OFFSET(ChartPrep!$L$4,0,0,nCurrencyExposures,1),ChartPrep!E41),\"\")","v":""},null,{"$f":"IF(ChartPrep!$F41,INDEX(ChartPrep!I$4:I$43,MATCH($A41,ChartPrep!$L$4:$L$43,0)),\"\")","v":""},{"$f":"IF(ChartPrep!$F41,INDEX(ChartPrep!J$4:J$43,MATCH($A41,ChartPrep!$L$4:$L$43,0)),\"\")","v":""},{"$f":"IF(ChartPrep!$F41,INDEX(ChartPrep!K$4:K$43,MATCH($A41,ChartPrep!$L$4:$L$43,0)),\"\")","v":""}]
[{"$f":"IF(ChartPrep!$F42,LARGE(OFFSET(ChartPrep!$L$4,0,0,nCurrencyExposures,1),ChartPrep!E42),\"\")","v":""},null,{"$f":"IF(ChartPrep!$F42,INDEX(ChartPrep!I$4:I$43,MATCH($A42,ChartPrep!$L$4:$L$43,0)),\"\")","v":""},{"$f":"IF(ChartPrep!$F42,INDEX(ChartPrep!J$4:J$43,MATCH($A42,ChartPrep!$L$4:$L$43,0)),\"\")","v":""},{"$f":"IF(ChartPrep!$F42,INDEX(ChartPrep!K$4:K$43,MATCH($A42,ChartPrep!$L$4:$L$43,0)),\"\")","v":""}]
[{"$f":"IF(ChartPrep!$F43,LARGE(OFFSET(ChartPrep!$L$4,0,0,nCurrencyExposures,1),ChartPrep!E43),\"\")","v":""},null,{"$f":"IF(ChartPrep!$F43,INDEX(ChartPrep!I$4:I$43,MATCH($A43,ChartPrep!$L$4:$L$43,0)),\"\")","v":""},{"$f":"IF(ChartPrep!$F43,INDEX(ChartPrep!J$4:J$43,MATCH($A43,ChartPrep!$L$4:$L$43,0)),\"\")","v":""},{"$f":"IF(ChartPrep!$F43,INDEX(ChartPrep!K$4:K$43,MATCH($A43,ChartPrep!$L$4:$L$43,0)),\"\")","v":""}]

{"sheet":"Table_FR","index":9,"n_rows":43,"n_cols":5,"rows_kept":43,"cut":false,"hidden":true,"merged":[]}
[null,null,{"$f":"INDEX(tFundsWithExposuresFR,ChartPrep!C5)","v":"Fonds toutes actions Chine Mackenzie"}]
[null,null,{"$f":"\"au \" & TEXT(ChartPrep!C4,\"d\") & \" \" & INDEX(tMonthsFR,MONTH(ChartPrep!C4)+1,1) & \" \" & TEXT(ChartPrep!C4,\"yyyy\")","v":"au 31 octobre 2019"}]
[null,null,"devise","exposition aux devises brute provenant des placements en portefeuille","exposition aux devises nette après toute couverture"]
[{"$f":"IF(ChartPrep!$F4,LARGE(OFFSET(ChartPrep!$L$4,0,0,nCurrencyExposures,1),ChartPrep!E4),\"\")","v":3.95},null,{"$f":"IF(ChartPrep!$F4,INDEX(tCurrencyNamesFR,MATCH(Table_EN!C4,tCurrencyNamesEN,0),1),\"\")","v":"Yuan renminbi chinois"},{"$f":"IF(ChartPrep!$F4,INDEX(ChartPrep!J$4:J$43,MATCH($A4,ChartPrep!$L$4:$L$43,0)),\"\")","v":0.65918040456112181},{"$f":"IF(ChartPrep!$F4,INDEX(ChartPrep!K$4:K$43,MATCH($A4,ChartPrep!$L$4:$L$43,0)),\"\")","v":0.65918040456112181}]
[{"$f":"IF(ChartPrep!$F5,LARGE(OFFSET(ChartPrep!$L$4,0,0,nCurrencyExposures,1),ChartPrep!E5),\"\")","v":2.94},null,{"$f":"IF(ChartPrep!$F5,INDEX(tCurrencyNamesFR,MATCH(Table_EN!C5,tCurrencyNamesEN,0),1),\"\")","v":"Dollar de Hong Kong"},{"$f":"IF(ChartPrep!$F5,INDEX(ChartPrep!J$4:J$43,MATCH($A5,ChartPrep!$L$4:$L$43,0)),\"\")","v":0.24427049818605465},{"$f":"IF(ChartPrep!$F5,INDEX(ChartPrep!K$4:K$43,MATCH($A5,ChartPrep!$L$4:$L$43,0)),\"\")","v":0.24427049818605465}]
[{"$f":"IF(ChartPrep!$F6,LARGE(OFFSET(ChartPrep!$L$4,0,0,nCurrencyExposures,1),ChartPrep!E6),\"\")","v":1.93},null,{"$f":"IF(ChartPrep!$F6,INDEX(tCurrencyNamesFR,MATCH(Table_EN!C6,tCurrencyNamesEN,0),1),\"\")","v":"Dollar américain"},{"$f":"IF(ChartPrep!$F6,INDEX(ChartPrep!J$4:J$43,MATCH($A6,ChartPrep!$L$4:$L$43,0)),\"\")","v":8.1949402695866869E-2},{"$f":"IF(ChartPrep!$F6,INDEX(ChartPrep!K$4:K$43,MATCH($A6,ChartPrep!$L$4:$L$43,0)),\"\")","v":8.1949402695866869E-2}]
[{"$f":"IF(ChartPrep!$F7,LARGE(OFFSET(ChartPrep!$L$4,0,0,nCurrencyExposures,1),ChartPrep!E7),\"\")","v":0.96},null,{"$f":"IF(ChartPrep!$F7,INDEX(tCurrencyNamesFR,MATCH(Table_EN!C7,tCurrencyNamesEN,0),1),\"\")","v":"Dollar canadien"},{"$f":"IF(ChartPrep!$F7,INDEX(ChartPrep!J$4:J$43,MATCH($A7,ChartPrep!$L$4:$L$43,0)),\"\")","v":1.4599090914578568E-2},{"$f":"IF(ChartPrep!$F7,INDEX(ChartPrep!K$4:K$43,MATCH($A7,ChartPrep!$L$4:$L$43,0)),\"\")","v":1.4599090914578568E-2}]
[{"$f":"IF(ChartPrep!$F8,LARGE(OFFSET(ChartPrep!$L$4,0,0,nCurrencyExposures,1),ChartPrep!E8),\"\")","v":""},null,{"$f":"IF(ChartPrep!$F8,INDEX(tCurrencyNamesFR,MATCH(Table_EN!C8,tCurrencyNamesEN,0),1),\"\")","v":""},{"$f":"IF(ChartPrep!$F8,INDEX(ChartPrep!J$4:J$43,MATCH($A8,ChartPrep!$L$4:$L$43,0)),\"\")","v":""},{"$f":"IF(ChartPrep!$F8,INDEX(ChartPrep!K$4:K$43,MATCH($A8,ChartPrep!$L$4:$L$43,0)),\"\")","v":""}]
[{"$f":"IF(ChartPrep!$F9,LARGE(OFFSET(ChartPrep!$L$4,0,0,nCurrencyExposures,1),ChartPrep!E9),\"\")","v":""},null,{"$f":"IF(ChartPrep!$F9,INDEX(tCurrencyNamesFR,MATCH(Table_EN!C9,tCurrencyNamesEN,0),1),\"\")","v":""},{"$f":"IF(ChartPrep!$F9,INDEX(ChartPrep!J$4:J$43,MATCH($A9,ChartPrep!$L$4:$L$43,0)),\"\")","v":""},{"$f":"IF(ChartPrep!$F9,INDEX(ChartPrep!K$4:K$43,MATCH($A9,ChartPrep!$L$4:$L$43,0)),\"\")","v":""}]
[{"$f":"IF(ChartPrep!$F10,LARGE(OFFSET(ChartPrep!$L$4,0,0,nCurrencyExposures,1),ChartPrep!E10),\"\")","v":""},null,{"$f":"IF(ChartPrep!$F10,INDEX(tCurrencyNamesFR,MATCH(Table_EN!C10,tCurrencyNamesEN,0),1),\"\")","v":""},{"$f":"IF(ChartPrep!$F10,INDEX(ChartPrep!J$4:J$43,MATCH($A10,ChartPrep!$L$4:$L$43,0)),\"\")","v":""},{"$f":"IF(ChartPrep!$F10,INDEX(ChartPrep!K$4:K$43,MATCH($A10,ChartPrep!$L$4:$L$43,0)),\"\")","v":""}]
[{"$f":"IF(ChartPrep!$F11,LARGE(OFFSET(ChartPrep!$L$4,0,0,nCurrencyExposures,1),ChartPrep!E11),\"\")","v":""},null,{"$f":"IF(ChartPrep!$F11,INDEX(tCurrencyNamesFR,MATCH(Table_EN!C11,tCurrencyNamesEN,0),1),\"\")","v":""},{"$f":"IF(ChartPrep!$F11,INDEX(ChartPrep!J$4:J$43,MATCH($A11,ChartPrep!$L$4:$L$43,0)),\"\")","v":""},{"$f":"IF(ChartPrep!$F11,INDEX(ChartPrep!K$4:K$43,MATCH($A11,ChartPrep!$L$4:$L$43,0)),\"\")","v":""}]
[{"$f":"IF(ChartPrep!$F12,LARGE(OFFSET(ChartPrep!$L$4,0,0,nCurrencyExposures,1),ChartPrep!E12),\"\")","v":""},null,{"$f":"IF(ChartPrep!$F12,INDEX(tCurrencyNamesFR,MATCH(Table_EN!C12,tCurrencyNamesEN,0),1),\"\")","v":""},{"$f":"IF(ChartPrep!$F12,INDEX(ChartPrep!J$4:J$43,MATCH($A12,ChartPrep!$L$4:$L$43,0)),\"\")","v":""},{"$f":"IF(ChartPrep!$F12,INDEX(ChartPrep!K$4:K$43,MATCH($A12,ChartPrep!$L$4:$L$43,0)),\"\")","v":""}]
[{"$f":"IF(ChartPrep!$F13,LARGE(OFFSET(ChartPrep!$L$4,0,0,nCurrencyExposures,1),ChartPrep!E13),\"\")","v":""},null,{"$f":"IF(ChartPrep!$F13,INDEX(tCurrencyNamesFR,MATCH(Table_EN!C13,tCurrencyNamesEN,0),1),\"\")","v":""},{"$f":"IF(ChartPrep!$F13,INDEX(ChartPrep!J$4:J$43,MATCH($A13,ChartPrep!$L$4:$L$43,0)),\"\")","v":""},{"$f":"IF(ChartPrep!$F13,INDEX(ChartPrep!K$4:K$43,MATCH($A13,ChartPrep!$L$4:$L$43,0)),\"\")","v":""}]
[{"$f":"IF(ChartPrep!$F14,LARGE(OFFSET(ChartPrep!$L$4,0,0,nCurrencyExposures,1),ChartPrep!E14),\"\")","v":""},null,{"$f":"IF(ChartPrep!$F14,INDEX(tCurrencyNamesFR,MATCH(Table_EN!C14,tCurrencyNamesEN,0),1),\"\")","v":""},{"$f":"IF(ChartPrep!$F14,INDEX(ChartPrep!J$4:J$43,MATCH($A14,ChartPrep!$L$4:$L$43,0)),\"\")","v":""},{"$f":"IF(ChartPrep!$F14,INDEX(ChartPrep!K$4:K$43,MATCH($A14,ChartPrep!$L$4:$L$43,0)),\"\")","v":""}]
[{"$f":"IF(ChartPrep!$F15,LARGE(OFFSET(ChartPrep!$L$4,0,0,nCurrencyExposures,1),ChartPrep!E15),\"\")","v":""},null,{"$f":"IF(ChartPrep!$F15,INDEX(tCurrencyNamesFR,MATCH(Table_EN!C15,tCurrencyNamesEN,0),1),\"\")","v":""},{"$f":"IF(ChartPrep!$F15,INDEX(ChartPrep!J$4:J$43,MATCH($A15,ChartPrep!$L$4:$L$43,0)),\"\")","v":""},{"$f":"IF(ChartPrep!$F15,INDEX(ChartPrep!K$4:K$43,MATCH($A15,ChartPrep!$L$4:$L$43,0)),\"\")","v":""}]
[{"$f":"IF(ChartPrep!$F16,LARGE(OFFSET(ChartPrep!$L$4,0,0,nCurrencyExposures,1),ChartPrep!E16),\"\")","v":""},null,{"$f":"IF(ChartPrep!$F16,INDEX(tCurrencyNamesFR,MATCH(Table_EN!C16,tCurrencyNamesEN,0),1),\"\")","v":""},{"$f":"IF(ChartPrep!$F16,INDEX(ChartPrep!J$4:J$43,MATCH($A16,ChartPrep!$L$4:$L$43,0)),\"\")","v":""},{"$f":"IF(ChartPrep!$F16,INDEX(ChartPrep!K$4:K$43,MATCH($A16,ChartPrep!$L$4:$L$43,0)),\"\")","v":""}]
[{"$f":"IF(ChartPrep!$F17,LARGE(OFFSET(ChartPrep!$L$4,0,0,nCurrencyExposures,1),ChartPrep!E17),\"\")","v":""},null,{"$f":"IF(ChartPrep!$F17,INDEX(tCurrencyNamesFR,MATCH(Table_EN!C17,tCurrencyNamesEN,0),1),\"\")","v":""},{"$f":"IF(ChartPrep!$F17,INDEX(ChartPrep!J$4:J$43,MATCH($A17,ChartPrep!$L$4:$L$43,0)),\"\")","v":""},{"$f":"IF(ChartPrep!$F17,INDEX(ChartPrep!K$4:K$43,MATCH($A17,ChartPrep!$L$4:$L$43,0)),\"\")","v":""}]
[{"$f":"IF(ChartPrep!$F18,LARGE(OFFSET(ChartPrep!$L$4,0,0,nCurrencyExposures,1),ChartPrep!E18),\"\")","v":""},null,{"$f":"IF(ChartPrep!$F18,INDEX(tCurrencyNamesFR,MATCH(Table_EN!C18,tCurrencyNamesEN,0),1),\"\")","v":""},{"$f":"IF(ChartPrep!$F18,INDEX(ChartPrep!J$4:J$43,MATCH($A18,ChartPrep!$L$4:$L$43,0)),\"\")","v":""},{"$f":"IF(ChartPrep!$F18,INDEX(ChartPrep!K$4:K$43,MATCH($A18,ChartPrep!$L$4:$L$43,0)),\"\")","v":""}]
[{"$f":"IF(ChartPrep!$F19,LARGE(OFFSET(ChartPrep!$L$4,0,0,nCurrencyExposures,1),ChartPrep!E19),\"\")","v":""},null,{"$f":"IF(ChartPrep!$F19,INDEX(tCurrencyNamesFR,MATCH(Table_EN!C19,tCurrencyNamesEN,0),1),\"\")","v":""},{"$f":"IF(ChartPrep!$F19,INDEX(ChartPrep!J$4:J$43,MATCH($A19,ChartPrep!$L$4:$L$43,0)),\"\")","v":""},{"$f":"IF(ChartPrep!$F19,INDEX(ChartPrep!K$4:K$43,MATCH($A19,ChartPrep!$L$4:$L$43,0)),\"\")","v":""}]
[{"$f":"IF(ChartPrep!$F20,LARGE(OFFSET(ChartPrep!$L$4,0,0,nCurrencyExposures,1),ChartPrep!E20),\"\")","v":""},null,{"$f":"IF(ChartPrep!$F20,INDEX(tCurrencyNamesFR,MATCH(Table_EN!C20,tCurrencyNamesEN,0),1),\"\")","v":""},{"$f":"IF(ChartPrep!$F20,INDEX(ChartPrep!J$4:J$43,MATCH($A20,ChartPrep!$L$4:$L$43,0)),\"\")","v":""},{"$f":"IF(ChartPrep!$F20,INDEX(ChartPrep!K$4:K$43,MATCH($A20,ChartPrep!$L$4:$L$43,0)),\"\")","v":""}]
[{"$f":"IF(ChartPrep!$F21,LARGE(OFFSET(ChartPrep!$L$4,0,0,nCurrencyExposures,1),ChartPrep!E21),\"\")","v":""},null,{"$f":"IF(ChartPrep!$F21,INDEX(tCurrencyNamesFR,MATCH(Table_EN!C21,tCurrencyNamesEN,0),1),\"\")","v":""},{"$f":"IF(ChartPrep!$F21,INDEX(ChartPrep!J$4:J$43,MATCH($A21,ChartPrep!$L$4:$L$43,0)),\"\")","v":""},{"$f":"IF(ChartPrep!$F21,INDEX(ChartPrep!K$4:K$43,MATCH($A21,ChartPrep!$L$4:$L$43,0)),\"\")","v":""}]
[{"$f":"IF(ChartPrep!$F22,LARGE(OFFSET(ChartPrep!$L$4,0,0,nCurrencyExposures,1),ChartPrep!E22),\"\")","v":""},null,{"$f":"IF(ChartPrep!$F22,INDEX(tCurrencyNamesFR,MATCH(Table_EN!C22,tCurrencyNamesEN,0),1),\"\")","v":""},{"$f":"IF(ChartPrep!$F22,INDEX(ChartPrep!J$4:J$43,MATCH($A22,ChartPrep!$L$4:$L$43,0)),\"\")","v":""},{"$f":"IF(ChartPrep!$F22,INDEX(ChartPrep!K$4:K$43,MATCH($A22,ChartPrep!$L$4:$L$43,0)),\"\")","v":""}]
[{"$f":"IF(ChartPrep!$F23,LARGE(OFFSET(ChartPrep!$L$4,0,0,nCurrencyExposures,1),ChartPrep!E23),\"\")","v":""},null,{"$f":"IF(ChartPrep!$F23,INDEX(tCurrencyNamesFR,MATCH(Table_EN!C23,tCurrencyNamesEN,0),1),\"\")","v":""},{"$f":"IF(ChartPrep!$F23,INDEX(ChartPrep!J$4:J$43,MATCH($A23,ChartPrep!$L$4:$L$43,0)),\"\")","v":""},{"$f":"IF(ChartPrep!$F23,INDEX(ChartPrep!K$4:K$43,MATCH($A23,ChartPrep!$L$4:$L$43,0)),\"\")","v":""}]
[{"$f":"IF(ChartPrep!$F24,LARGE(OFFSET(ChartPrep!$L$4,0,0,nCurrencyExposures,1),ChartPrep!E24),\"\")","v":""},null,{"$f":"IF(ChartPrep!$F24,INDEX(tCurrencyNamesFR,MATCH(Table_EN!C24,tCurrencyNamesEN,0),1),\"\")","v":""},{"$f":"IF(ChartPrep!$F24,INDEX(ChartPrep!J$4:J$43,MATCH($A24,ChartPrep!$L$4:$L$43,0)),\"\")","v":""},{"$f":"IF(ChartPrep!$F24,INDEX(ChartPrep!K$4:K$43,MATCH($A24,ChartPrep!$L$4:$L$43,0)),\"\")","v":""}]
[{"$f":"IF(ChartPrep!$F25,LARGE(OFFSET(ChartPrep!$L$4,0,0,nCurrencyExposures,1),ChartPrep!E25),\"\")","v":""},null,{"$f":"IF(ChartPrep!$F25,INDEX(tCurrencyNamesFR,MATCH(Table_EN!C25,tCurrencyNamesEN,0),1),\"\")","v":""},{"$f":"IF(ChartPrep!$F25,INDEX(ChartPrep!J$4:J$43,MATCH($A25,ChartPrep!$L$4:$L$43,0)),\"\")","v":""},{"$f":"IF(ChartPrep!$F25,INDEX(ChartPrep!K$4:K$43,MATCH($A25,ChartPrep!$L$4:$L$43,0)),\"\")","v":""}]
[{"$f":"IF(ChartPrep!$F26,LARGE(OFFSET(ChartPrep!$L$4,0,0,nCurrencyExposures,1),ChartPrep!E26),\"\")","v":""},null,{"$f":"IF(ChartPrep!$F26,INDEX(tCurrencyNamesFR,MATCH(Table_EN!C26,tCurrencyNamesEN,0),1),\"\")","v":""},{"$f":"IF(ChartPrep!$F26,INDEX(ChartPrep!J$4:J$43,MATCH($A26,ChartPrep!$L$4:$L$43,0)),\"\")","v":""},{"$f":"IF(ChartPrep!$F26,INDEX(ChartPrep!K$4:K$43,MATCH($A26,ChartPrep!$L$4:$L$43,0)),\"\")","v":""}]
[{"$f":"IF(ChartPrep!$F27,LARGE(OFFSET(ChartPrep!$L$4,0,0,nCurrencyExposures,1),ChartPrep!E27),\"\")","v":""},null,{"$f":"IF(ChartPrep!$F27,INDEX(tCurrencyNamesFR,MATCH(Table_EN!C27,tCurrencyNamesEN,0),1),\"\")","v":""},{"$f":"IF(ChartPrep!$F27,INDEX(ChartPrep!J$4:J$43,MATCH($A27,ChartPrep!$L$4:$L$43,0)),\"\")","v":""},{"$f":"IF(ChartPrep!$F27,INDEX(ChartPrep!K$4:K$43,MATCH($A27,ChartPrep!$L$4:$L$43,0)),\"\")","v":""}]
[{"$f":"IF(ChartPrep!$F28,LARGE(OFFSET(ChartPrep!$L$4,0,0,nCurrencyExposures,1),ChartPrep!E28),\"\")","v":""},null,{"$f":"IF(ChartPrep!$F28,INDEX(tCurrencyNamesFR,MATCH(Table_EN!C28,tCurrencyNamesEN,0),1),\"\")","v":""},{"$f":"IF(ChartPrep!$F28,INDEX(ChartPrep!J$4:J$43,MATCH($A28,ChartPrep!$L$4:$L$43,0)),\"\")","v":""},{"$f":"IF(ChartPrep!$F28,INDEX(ChartPrep!K$4:K$43,MATCH($A28,ChartPrep!$L$4:$L$43,0)),\"\")","v":""}]
[{"$f":"IF(ChartPrep!$F29,LARGE(OFFSET(ChartPrep!$L$4,0,0,nCurrencyExposures,1),ChartPrep!E29),\"\")","v":""},null,{"$f":"IF(ChartPrep!$F29,INDEX(tCurrencyNamesFR,MATCH(Table_EN!C29,tCurrencyNamesEN,0),1),\"\")","v":""},{"$f":"IF(ChartPrep!$F29,INDEX(ChartPrep!J$4:J$43,MATCH($A29,ChartPrep!$L$4:$L$43,0)),\"\")","v":""},{"$f":"IF(ChartPrep!$F29,INDEX(ChartPrep!K$4:K$43,MATCH($A29,ChartPrep!$L$4:$L$43,0)),\"\")","v":""}]
[{"$f":"IF(ChartPrep!$F30,LARGE(OFFSET(ChartPrep!$L$4,0,0,nCurrencyExposures,1),ChartPrep!E30),\"\")","v":""},null,{"$f":"IF(ChartPrep!$F30,INDEX(tCurrencyNamesFR,MATCH(Table_EN!C30,tCurrencyNamesEN,0),1),\"\")","v":""},{"$f":"IF(ChartPrep!$F30,INDEX(ChartPrep!J$4:J$43,MATCH($A30,ChartPrep!$L$4:$L$43,0)),\"\")","v":""},{"$f":"IF(ChartPrep!$F30,INDEX(ChartPrep!K$4:K$43,MATCH($A30,ChartPrep!$L$4:$L$43,0)),\"\")","v":""}]
[{"$f":"IF(ChartPrep!$F31,LARGE(OFFSET(ChartPrep!$L$4,0,0,nCurrencyExposures,1),ChartPrep!E31),\"\")","v":""},null,{"$f":"IF(ChartPrep!$F31,INDEX(tCurrencyNamesFR,MATCH(Table_EN!C31,tCurrencyNamesEN,0),1),\"\")","v":""},{"$f":"IF(ChartPrep!$F31,INDEX(ChartPrep!J$4:J$43,MATCH($A31,ChartPrep!$L$4:$L$43,0)),\"\")","v":""},{"$f":"IF(ChartPrep!$F31,INDEX(ChartPrep!K$4:K$43,MATCH($A31,ChartPrep!$L$4:$L$43,0)),\"\")","v":""}]
[{"$f":"IF(ChartPrep!$F32,LARGE(OFFSET(ChartPrep!$L$4,0,0,nCurrencyExposures,1),ChartPrep!E32),\"\")","v":""},null,{"$f":"IF(ChartPrep!$F32,INDEX(tCurrencyNamesFR,MATCH(Table_EN!C32,tCurrencyNamesEN,0),1),\"\")","v":""},{"$f":"IF(ChartPrep!$F32,INDEX(ChartPrep!J$4:J$43,MATCH($A32,ChartPrep!$L$4:$L$43,0)),\"\")","v":""},{"$f":"IF(ChartPrep!$F32,INDEX(ChartPrep!K$4:K$43,MATCH($A32,ChartPrep!$L$4:$L$43,0)),\"\")","v":""}]
[{"$f":"IF(ChartPrep!$F33,LARGE(OFFSET(ChartPrep!$L$4,0,0,nCurrencyExposures,1),ChartPrep!E33),\"\")","v":""},null,{"$f":"IF(ChartPrep!$F33,INDEX(tCurrencyNamesFR,MATCH(Table_EN!C33,tCurrencyNamesEN,0),1),\"\")","v":""},{"$f":"IF(ChartPrep!$F33,INDEX(ChartPrep!J$4:J$43,MATCH($A33,ChartPrep!$L$4:$L$43,0)),\"\")","v":""},{"$f":"IF(ChartPrep!$F33,INDEX(ChartPrep!K$4:K$43,MATCH($A33,ChartPrep!$L$4:$L$43,0)),\"\")","v":""}]
[{"$f":"IF(ChartPrep!$F34,LARGE(OFFSET(ChartPrep!$L$4,0,0,nCurrencyExposures,1),ChartPrep!E34),\"\")","v":""},null,{"$f":"IF(ChartPrep!$F34,INDEX(tCurrencyNamesFR,MATCH(Table_EN!C34,tCurrencyNamesEN,0),1),\"\")","v":""},{"$f":"IF(ChartPrep!$F34,INDEX(ChartPrep!J$4:J$43,MATCH($A34,ChartPrep!$L$4:$L$43,0)),\"\")","v":""},{"$f":"IF(ChartPrep!$F34,INDEX(ChartPrep!K$4:K$43,MATCH($A34,ChartPrep!$L$4:$L$43,0)),\"\")","v":""}]
[{"$f":"IF(ChartPrep!$F35,LARGE(OFFSET(ChartPrep!$L$4,0,0,nCurrencyExposures,1),ChartPrep!E35),\"\")","v":""},null,{"$f":"IF(ChartPrep!$F35,INDEX(tCurrencyNamesFR,MATCH(Table_EN!C35,tCurrencyNamesEN,0),1),\"\")","v":""},{"$f":"IF(ChartPrep!$F35,INDEX(ChartPrep!J$4:J$43,MATCH($A35,ChartPrep!$L$4:$L$43,0)),\"\")","v":""},{"$f":"IF(ChartPrep!$F35,INDEX(ChartPrep!K$4:K$43,MATCH($A35,ChartPrep!$L$4:$L$43,0)),\"\")","v":""}]
[{"$f":"IF(ChartPrep!$F36,LARGE(OFFSET(ChartPrep!$L$4,0,0,nCurrencyExposures,1),ChartPrep!E36),\"\")","v":""},null,{"$f":"IF(ChartPrep!$F36,INDEX(tCurrencyNamesFR,MATCH(Table_EN!C36,tCurrencyNamesEN,0),1),\"\")","v":""},{"$f":"IF(ChartPrep!$F36,INDEX(ChartPrep!J$4:J$43,MATCH($A36,ChartPrep!$L$4:$L$43,0)),\"\")","v":""},{"$f":"IF(ChartPrep!$F36,INDEX(ChartPrep!K$4:K$43,MATCH($A36,ChartPrep!$L$4:$L$43,0)),\"\")","v":""}]
[{"$f":"IF(ChartPrep!$F37,LARGE(OFFSET(ChartPrep!$L$4,0,0,nCurrencyExposures,1),ChartPrep!E37),\"\")","v":""},null,{"$f":"IF(ChartPrep!$F37,INDEX(tCurrencyNamesFR,MATCH(Table_EN!C37,tCurrencyNamesEN,0),1),\"\")","v":""},{"$f":"IF(ChartPrep!$F37,INDEX(ChartPrep!J$4:J$43,MATCH($A37,ChartPrep!$L$4:$L$43,0)),\"\")","v":""},{"$f":"IF(ChartPrep!$F37,INDEX(ChartPrep!K$4:K$43,MATCH($A37,ChartPrep!$L$4:$L$43,0)),\"\")","v":""}]
[{"$f":"IF(ChartPrep!$F38,LARGE(OFFSET(ChartPrep!$L$4,0,0,nCurrencyExposures,1),ChartPrep!E38),\"\")","v":""},null,{"$f":"IF(ChartPrep!$F38,INDEX(tCurrencyNamesFR,MATCH(Table_EN!C38,tCurrencyNamesEN,0),1),\"\")","v":""},{"$f":"IF(ChartPrep!$F38,INDEX(ChartPrep!J$4:J$43,MATCH($A38,ChartPrep!$L$4:$L$43,0)),\"\")","v":""},{"$f":"IF(ChartPrep!$F38,INDEX(ChartPrep!K$4:K$43,MATCH($A38,ChartPrep!$L$4:$L$43,0)),\"\")","v":""}]
[{"$f":"IF(ChartPrep!$F39,LARGE(OFFSET(ChartPrep!$L$4,0,0,nCurrencyExposures,1),ChartPrep!E39),\"\")","v":""},null,{"$f":"IF(ChartPrep!$F39,INDEX(tCurrencyNamesFR,MATCH(Table_EN!C39,tCurrencyNamesEN,0),1),\"\")","v":""},{"$f":"IF(ChartPrep!$F39,INDEX(ChartPrep!J$4:J$43,MATCH($A39,ChartPrep!$L$4:$L$43,0)),\"\")","v":""},{"$f":"IF(ChartPrep!$F39,INDEX(ChartPrep!K$4:K$43,MATCH($A39,ChartPrep!$L$4:$L$43,0)),\"\")","v":""}]
[{"$f":"IF(ChartPrep!$F40,LARGE(OFFSET(ChartPrep!$L$4,0,0,nCurrencyExposures,1),ChartPrep!E40),\"\")","v":""},null,{"$f":"IF(ChartPrep!$F40,INDEX(tCurrencyNamesFR,MATCH(Table_EN!C40,tCurrencyNamesEN,0),1),\"\")","v":""},{"$f":"IF(ChartPrep!$F40,INDEX(ChartPrep!J$4:J$43,MATCH($A40,ChartPrep!$L$4:$L$43,0)),\"\")","v":""},{"$f":"IF(ChartPrep!$F40,INDEX(ChartPrep!K$4:K$43,MATCH($A40,ChartPrep!$L$4:$L$43,0)),\"\")","v":""}]
[{"$f":"IF(ChartPrep!$F41,LARGE(OFFSET(ChartPrep!$L$4,0,0,nCurrencyExposures,1),ChartPrep!E41),\"\")","v":""},null,{"$f":"IF(ChartPrep!$F41,INDEX(tCurrencyNamesFR,MATCH(Table_EN!C41,tCurrencyNamesEN,0),1),\"\")","v":""},{"$f":"IF(ChartPrep!$F41,INDEX(ChartPrep!J$4:J$43,MATCH($A41,ChartPrep!$L$4:$L$43,0)),\"\")","v":""},{"$f":"IF(ChartPrep!$F41,INDEX(ChartPrep!K$4:K$43,MATCH($A41,ChartPrep!$L$4:$L$43,0)),\"\")","v":""}]
[{"$f":"IF(ChartPrep!$F42,LARGE(OFFSET(ChartPrep!$L$4,0,0,nCurrencyExposures,1),ChartPrep!E42),\"\")","v":""},null,{"$f":"IF(ChartPrep!$F42,INDEX(tCurrencyNamesFR,MATCH(Table_EN!C42,tCurrencyNamesEN,0),1),\"\")","v":""},{"$f":"IF(ChartPrep!$F42,INDEX(ChartPrep!J$4:J$43,MATCH($A42,ChartPrep!$L$4:$L$43,0)),\"\")","v":""},{"$f":"IF(ChartPrep!$F42,INDEX(ChartPrep!K$4:K$43,MATCH($A42,ChartPrep!$L$4:$L$43,0)),\"\")","v":""}]
[{"$f":"IF(ChartPrep!$F43,LARGE(OFFSET(ChartPrep!$L$4,0,0,nCurrencyExposures,1),ChartPrep!E43),\"\")","v":""},null,{"$f":"IF(ChartPrep!$F43,INDEX(tCurrencyNamesFR,MATCH(Table_EN!C43,tCurrencyNamesEN,0),1),\"\")","v":""},{"$f":"IF(ChartPrep!$F43,INDEX(ChartPrep!J$4:J$43,MATCH($A43,ChartPrep!$L$4:$L$43,0)),\"\")","v":""},{"$f":"IF(ChartPrep!$F43,INDEX(ChartPrep!K$4:K$43,MATCH($A43,ChartPrep!$L$4:$L$43,0)),\"\")","v":""}]